Page 2 of 16 FirstFirst 123412 ... LastLast
Results 11 to 20 of 153

Thread: [SOLVED] HOWTO: nifty gmail checker (checkgmail)

  1. #11
    arnieboy Guest

    Re: HOWTO: nifty gmail checker (checkgmail)

    Quote Originally Posted by manicka
    tomboy 0.3.1-0Ubuntu6
    aah.. the note taking app..

  2. #12
    Join Date
    Jul 2005
    Location
    Brasil
    Beans
    52
    Distro
    Ubuntu 7.04 Feisty Fawn

    Re: HOWTO: nifty gmail checker (checkgmail)

    Hi, thanks for your how-to
    When executing the 4th command (sudo perl -MCPAN -e 'install Crypt::SSLeay'), it stopped:

    Code:
    No OpenSSL installation found, usually in /usr/local/openssl
    Which OpenSSL build path do you want to link against?
    I don't know what to type here
    Can you help me with this?

  3. #13
    arnieboy Guest

    Re: HOWTO: nifty gmail checker (checkgmail)

    Quote Originally Posted by LaSSarD
    Hi, thanks for your how-to
    When executing the 4th command (sudo perl -MCPAN -e 'install Crypt::SSLeay'), it stopped:

    Code:
    No OpenSSL installation found, usually in /usr/local/openssl
    Which OpenSSL build path do you want to link against?
    I don't know what to type here
    Can you help me with this?
    do the following in a new terminal window:
    Code:
    sudo apt-get install openssl
    and then hit enter on the perl module installation step . it will automatically detect that openssl is installed.
    or u can restart the installation of the perl modules again.
    Last edited by arnieboy; August 28th, 2005 at 01:32 AM.

  4. #14
    Join Date
    Mar 2005
    Location
    RVA
    Beans
    106
    Distro
    Ubuntu Breezy 5.10

    Re: HOWTO: nifty gmail checker (checkgmail)

    Quote Originally Posted by LaSSarD
    Hi, thanks for your how-to
    When executing the 4th command (sudo perl -MCPAN -e 'install Crypt::SSLeay'), it stopped:

    Code:
    No OpenSSL installation found, usually in /usr/local/openssl
    Which OpenSSL build path do you want to link against?
    I don't know what to type here
    Can you help me with this?
    I'm pretty sure you need to install libssl-dev, so open up a terminal and type
    Code:
    sudo apt-get install libssl-dev
    Then try sudo perl -MCPAN -e 'install Crypt::SSLeay again.

  5. #15
    Join Date
    Apr 2005
    Beans
    40

    Re: HOWTO: nifty gmail checker (checkgmail)

    SSLeay.c:844: error: syntax error before ')' token
    SSLeay.xs:434: error: invalid type argument of `->'
    SSLeay.c: In function `XS_Crypt__SSLeay__X509_get_notAfterString':
    SSLeay.c:863: error: `X509' undeclared (first use in this function)
    SSLeay.c:863: error: `cert' undeclared (first use in this function)
    SSLeay.c:869: error: syntax error before ')' token
    SSLeay.xs:442: error: invalid type argument of `->'
    make: *** [SSLeay.o] Error 1
    /usr/bin/make -- NOT OK
    Running make test
    Can't test without successful make
    Running make install
    make had returned bad status, install seems impossible
    any idea what this is about?

  6. #16
    arnieboy Guest

    Re: HOWTO: nifty gmail checker (checkgmail)

    Quote Originally Posted by cannibalbob
    any idea what this is about?
    did u get this error when u tried to do:
    Code:
    sudo perl -MCPAN -e 'install Crypt::SSLeay'
    ?

  7. #17
    Join Date
    Apr 2005
    Beans
    40

    Re: HOWTO: nifty gmail checker (checkgmail)

    Quote Originally Posted by arnieboy
    did u get this error when u tried to do:
    Code:
    sudo perl -MCPAN -e 'install Crypt::SSLeay'
    ?
    yes

  8. #18
    arnieboy Guest

    Re: HOWTO: nifty gmail checker (checkgmail)

    Quote Originally Posted by cannibalbob
    yes
    though it looks like a bug in the code, it should not be a bug because its worked for quite a few of us. Please post the whole debugging info on the terminal after u press enter after typing sudo perl -MCPAN -e 'install Crypt::SSLeay' (the whole of it including the errors).

  9. #19
    Join Date
    Apr 2005
    Beans
    40

    Re: HOWTO: nifty gmail checker (checkgmail)

    CPAN: Storable loaded ok
    Going to read /home/andrew/.cpan/Metadata
    Database was generated on Sat, 27 Aug 2005 21:59:32 GMT
    Running install for module Crypt::SSLeay
    Running make for C/CH/CHAMAS/Crypt-SSLeay-0.51.tar.gz
    CPAN: LWP::UserAgent loaded ok
    Fetching with LWP:
    ftp://archive.progeny.com/CPAN/autho...0.51.tar.gzLWP failed with code[404] message[File 'Crypt-SSLeay-0.51.tar.gz' not found]
    Fetching with Net::FTP:
    ftp://archive.progeny.com/CPAN/authors/id/C/CH/CHAMAS/Crypt-SSLeay-0.51.tar.gzCouldn't fetch Crypt-SSLeay-0.51.tar.gz from archive.progeny.com
    Fetching with LWP:
    ftp://cpan-sj.viaverio.com/pub/CPAN/...ay-0.51.tar.gz
    LWP failed with code[404] message[File 'Crypt-SSLeay-0.51.tar.gz' not found]
    Fetching with Net::FTP:
    ftp://cpan-sj.viaverio.com/pub/CPAN/...ay-0.51.tar.gz
    Couldn't fetch Crypt-SSLeay-0.51.tar.gz from cpan-sj.viaverio.com
    Fetching with LWP:
    ftp://cpan.calvin.edu/pub/CPAN/autho...ay-0.51.tar.gz
    LWP failed with code[400] message[FTP return code 000]
    Fetching with Net::FTP:
    ftp://cpan.calvin.edu/pub/CPAN/authors/id/C/CH/CHAMAS/Crypt-SSLeay-0.51.tar.gzCouldn't fetch Crypt-SSLeay-0.51.tar.gz from cpan.calvin.edu

    Trying with "/usr/bin/lynx -source" to get
    ftp://archive.progeny.com/CPAN/autho...ay-0.51.tar.gz
    CPAN: Compress::Zlib loaded ok
    CPAN: Digest::MD5 loaded ok

    Trying with "/usr/bin/lynx -source" to get
    ftp://archive.progeny.com/CPAN/autho...AMAS/CHECKSUMS
    Checksum for /home/andrew/.cpan/sources/authors/id/C/CH/CHAMAS/Crypt-SSLeay-0.51.tar.gz ok
    Scanning cache /home/andrew/.cpan/build for sizes
    Crypt-SSLeay-0.51/
    Crypt-SSLeay-0.51/t/
    Crypt-SSLeay-0.51/t/net_ssl.t
    Crypt-SSLeay-0.51/t/ssl_context.t
    Crypt-SSLeay-0.51/lib/
    Crypt-SSLeay-0.51/lib/Crypt/
    Crypt-SSLeay-0.51/lib/Crypt/SSLeay/
    Crypt-SSLeay-0.51/lib/Crypt/SSLeay/MainContext.pm
    Crypt-SSLeay-0.51/lib/Crypt/SSLeay/Conn.pm
    Crypt-SSLeay-0.51/lib/Crypt/SSLeay/X509.pm
    Crypt-SSLeay-0.51/lib/Crypt/SSLeay/Err.pm
    Crypt-SSLeay-0.51/lib/Crypt/SSLeay/CTX.pm
    Crypt-SSLeay-0.51/lib/Net/
    Crypt-SSLeay-0.51/lib/Net/SSL.pm
    Crypt-SSLeay-0.51/certs/
    Crypt-SSLeay-0.51/certs/ca-bundle.crt
    Crypt-SSLeay-0.51/certs/notacakeynopass.pem
    Crypt-SSLeay-0.51/certs/notacacert.pem
    Crypt-SSLeay-0.51/MANIFEST
    Crypt-SSLeay-0.51/typemap
    Crypt-SSLeay-0.51/MANIFEST.SKIP
    Crypt-SSLeay-0.51/SSLeay.pm
    Crypt-SSLeay-0.51/CHANGES
    Crypt-SSLeay-0.51/lwp-ssl-test
    Crypt-SSLeay-0.51/net_ssl_test
    Crypt-SSLeay-0.51/SSLeay.xs
    Crypt-SSLeay-0.51/README
    Crypt-SSLeay-0.51/Makefile.PL

    CPAN.pm: Going to build C/CH/CHAMAS/Crypt-SSLeay-0.51.tar.gz

    No OpenSSL installation found, usually in /usr/local/openssl
    Which OpenSSL build path do you want to link against? Apparently no SSLeay installation at ''
    Are you sure you got it correct????

    ================================================
    BUILD INFORMATION
    ================================================

    ssl dir:
    libraries: -lssl -lcrypto -lgcc -lRSAglue -lrsaref
    include dir: /include
    ssl header: ssl.h
    ssl candidate: ; /include

    ================================================

    Checking if your kit is complete...
    Looks good
    Note (probably harmless): No library found for -lgcc
    Note (probably harmless): No library found for -lRSAglue
    Note (probably harmless): No library found for -lrsaref
    Writing Makefile for Crypt::SSLeay
    cp lib/Crypt/SSLeay/X509.pm blib/lib/Crypt/SSLeay/X509.pm
    cp lib/Net/SSL.pm blib/lib/Net/SSL.pm
    cp SSLeay.pm blib/lib/Crypt/SSLeay.pm
    cp lib/Crypt/SSLeay/MainContext.pm blib/lib/Crypt/SSLeay/MainContext.pm
    cp lib/Crypt/SSLeay/Conn.pm blib/lib/Crypt/SSLeay/Conn.pm
    cp lib/Crypt/SSLeay/CTX.pm blib/lib/Crypt/SSLeay/CTX.pm
    cp lib/Crypt/SSLeay/Err.pm blib/lib/Crypt/SSLeay/Err.pm
    /usr/bin/perl /usr/share/perl/5.8/ExtUtils/xsubpp -typemap /usr/share/perl/5.8/ExtUtils/typemap -typemap typemap SSLeay.xs > SSLeay.xsc && mv SSLeay.xsc SSLeay.c
    cc -c -I/include -D_REENTRANT -D_GNU_SOURCE -DTHREADS_HAVE_PIDS -DDEBIAN -fno-strict-aliasing -I/usr/local/include -D_LARGEFILE_SOURCE -D_FILE_OFFSET_BITS=64 -O2 -DVERSION=\"0.51\" -DXS_VERSION=\"0.51\" -fPIC "-I/usr/lib/perl/5.8/CORE" SSLeay.c
    In file included from SSLeay.xs:25:
    crypt_ssleay_version.h:1:17: ssl.h: No such file or directory
    crypt_ssleay_version.h:2:20: crypto.h: No such file or directory
    In file included from crypt_ssleay_version.h:3,
    from SSLeay.xs:25:
    /usr/include/err.h:37: error: syntax error before '(' token
    crypt_ssleay_version.h:4:18: rand.h: No such file or directory
    crypt_ssleay_version.h:5:20: pkcs12.h: No such file or directory
    SSLeay.xs:43: error: syntax error before '*' token
    SSLeay.xs: In function `InfoCallback':
    SSLeay.xs:48: error: `where' undeclared (first use in this function)
    SSLeay.xs:48: error: (Each undeclared identifier is reported only once
    SSLeay.xs:48: error: for each function it appears in.)
    SSLeay.xs:48: error: `SSL_ST_MASK' undeclared (first use in this function)
    SSLeay.xs:50: error: `SSL_ST_CONNECT' undeclared (first use in this function)
    SSLeay.xs:52: error: `SSL_ST_ACCEPT' undeclared (first use in this function)
    SSLeay.xs:57: error: `SSL_CB_LOOP' undeclared (first use in this function)
    SSLeay.xs:58: error: `s' undeclared (first use in this function)
    SSLeay.xs:59: error: `SSL_CB_ALERT' undeclared (first use in this function)
    SSLeay.xs:61: error: `SSL_CB_READ' undeclared (first use in this function)
    SSLeay.xs:63: error: `ret' undeclared (first use in this function)
    SSLeay.xs:66: error: `SSL_CB_EXIT' undeclared (first use in this function)
    SSLeay.c: In function `XS_Crypt__SSLeay__CTX_new':
    SSLeay.c:120: error: `SSL_CTX' undeclared (first use in this function)
    SSLeay.c:120: error: `RETVAL' undeclared (first use in this function)
    SSLeay.xs:104: error: `ctx' undeclared (first use in this function)
    SSLeay.xs:133: error: `SSL_OP_ALL' undeclared (first use in this function)
    SSLeay.xs:136: error: `SSL_VERIFY_NONE' undeclared (first use in this function)
    SSLeay.c: In function `XS_Crypt__SSLeay__CTX_free':
    SSLeay.c:173: error: `SSL_CTX' undeclared (first use in this function)
    SSLeay.c:173: error: `ctx' undeclared (first use in this function)
    SSLeay.c:177: error: syntax error before ')' token
    SSLeay.c: In function `XS_Crypt__SSLeay__CTX_set_cipher_list':
    SSLeay.c:194: error: `SSL_CTX' undeclared (first use in this function)
    SSLeay.c:194: error: `ctx' undeclared (first use in this function)
    SSLeay.c:201: error: syntax error before ')' token
    SSLeay.c: In function `XS_Crypt__SSLeay__CTX_use_certificate_file':
    SSLeay.c:219: error: `SSL_CTX' undeclared (first use in this function)
    SSLeay.c:219: error: `ctx' undeclared (first use in this function)
    SSLeay.c:227: error: syntax error before ')' token
    SSLeay.c: In function `XS_Crypt__SSLeay__CTX_use_PrivateKey_file':
    SSLeay.c:245: error: `SSL_CTX' undeclared (first use in this function)
    SSLeay.c:245: error: `ctx' undeclared (first use in this function)
    SSLeay.c:253: error: syntax error before ')' token
    SSLeay.c: In function `XS_Crypt__SSLeay__CTX_use_pkcs12_file':
    SSLeay.c:271: error: `SSL_CTX' undeclared (first use in this function)
    SSLeay.c:271: error: `ctx' undeclared (first use in this function)
    SSLeay.xs:172: error: `EVP_PKEY' undeclared (first use in this function)
    SSLeay.xs:172: error: `pkey' undeclared (first use in this function)
    SSLeay.xs:173: error: `X509' undeclared (first use in this function)
    SSLeay.xs:173: error: `cert' undeclared (first use in this function)
    SSLeay.xs:174: error: `ca' undeclared (first use in this function)
    SSLeay.xs:175: error: `PKCS12' undeclared (first use in this function)
    SSLeay.xs:175: error: `p12' undeclared (first use in this function)
    SSLeay.c:286: error: syntax error before ')' token
    SSLeay.c: In function `XS_Crypt__SSLeay__CTX_check_private_key':
    SSLeay.c:325: error: `SSL_CTX' undeclared (first use in this function)
    SSLeay.c:325: error: `ctx' undeclared (first use in this function)
    SSLeay.c:331: error: syntax error before ')' token
    SSLeay.c: In function `XS_Crypt__SSLeay__CTX_set_verify':
    SSLeay.c:349: error: `SSL_CTX' undeclared (first use in this function)
    SSLeay.c:349: error: `ctx' undeclared (first use in this function)
    SSLeay.c:358: error: syntax error before ')' token
    SSLeay.xs:217: error: `SSL_VERIFY_NONE' undeclared (first use in this function)
    SSLeay.xs:221: error: `SSL_VERIFY_PEER' undeclared (first use in this function)
    SSLeay.c: In function `XS_Crypt__SSLeay__Conn_new':
    SSLeay.c:389: error: `SSL_CTX' undeclared (first use in this function)
    SSLeay.c:389: error: `ctx' undeclared (first use in this function)
    SSLeay.xs:235: error: `SSL' undeclared (first use in this function)
    SSLeay.xs:235: error: `ssl' undeclared (first use in this function)
    SSLeay.c:394: error: `RETVAL' undeclared (first use in this function)
    SSLeay.c:398: error: syntax error before ')' token
    SSLeay.c: In function `XS_Crypt__SSLeay__Conn_free':
    SSLeay.c:443: error: `SSL' undeclared (first use in this function)
    SSLeay.c:443: error: `ssl' undeclared (first use in this function)
    SSLeay.c:447: error: syntax error before ')' token
    SSLeay.c: In function `XS_Crypt__SSLeay__Conn_set_fd':
    SSLeay.c:464: error: `SSL' undeclared (first use in this function)
    SSLeay.c:464: error: `ssl' undeclared (first use in this function)
    SSLeay.c:471: error: syntax error before ')' token
    SSLeay.c: In function `XS_Crypt__SSLeay__Conn_connect':
    SSLeay.c:489: error: `SSL' undeclared (first use in this function)
    SSLeay.c:489: error: `ssl' undeclared (first use in this function)
    SSLeay.c:495: error: syntax error before ')' token
    SSLeay.c: In function `XS_Crypt__SSLeay__Conn_accept':
    SSLeay.c:513: error: `SSL' undeclared (first use in this function)
    SSLeay.c:513: error: `ssl' undeclared (first use in this function)
    SSLeay.c:519: error: syntax error before ')' token
    SSLeay.c: In function `XS_Crypt__SSLeay__Conn_write':
    SSLeay.c:537: error: `SSL' undeclared (first use in this function)
    SSLeay.c:537: error: `ssl' undeclared (first use in this function)
    SSLeay.c:549: error: syntax error before ')' token
    SSLeay.c: In function `XS_Crypt__SSLeay__Conn_read':
    SSLeay.c:590: error: `SSL' undeclared (first use in this function)
    SSLeay.c:590: error: `ssl' undeclared (first use in this function)
    SSLeay.c:603: error: syntax error before ')' token
    SSLeay.c: In function `XS_Crypt__SSLeay__Conn_get_peer_certificate':
    SSLeay.c:655: error: `SSL' undeclared (first use in this function)
    SSLeay.c:655: error: `ssl' undeclared (first use in this function)
    SSLeay.c:656: error: `X509' undeclared (first use in this function)
    SSLeay.c:656: error: `RETVAL' undeclared (first use in this function)
    SSLeay.c:660: error: syntax error before ')' token
    SSLeay.c: In function `XS_Crypt__SSLeay__Conn_get_verify_result':
    SSLeay.c:679: error: `SSL' undeclared (first use in this function)
    SSLeay.c:679: error: `ssl' undeclared (first use in this function)
    SSLeay.c:684: error: syntax error before ')' token
    SSLeay.xs:377: error: `X509_V_OK' undeclared (first use in this function)
    SSLeay.c: In function `XS_Crypt__SSLeay__Conn_get_shared_ciphers':
    SSLeay.c:704: error: `SSL' undeclared (first use in this function)
    SSLeay.c:704: error: `ssl' undeclared (first use in this function)
    SSLeay.c:713: error: syntax error before ')' token
    SSLeay.xs:388: warning: assignment makes pointer from integer without a cast
    SSLeay.c: In function `XS_Crypt__SSLeay__Conn_get_cipher':
    SSLeay.c:732: error: `SSL' undeclared (first use in this function)
    SSLeay.c:732: error: `ssl' undeclared (first use in this function)
    SSLeay.c:738: error: syntax error before ')' token
    SSLeay.c: In function `XS_Crypt__SSLeay__X509_free':
    SSLeay.c:757: error: `X509' undeclared (first use in this function)
    SSLeay.c:757: error: `cert' undeclared (first use in this function)
    SSLeay.c:761: error: syntax error before ')' token
    SSLeay.c: In function `XS_Crypt__SSLeay__X509_subject_name':
    SSLeay.c:778: error: `X509' undeclared (first use in this function)
    SSLeay.c:778: error: `cert' undeclared (first use in this function)
    SSLeay.c:786: error: syntax error before ')' token
    SSLeay.xs:412: warning: assignment makes pointer from integer without a cast
    SSLeay.c: In function `XS_Crypt__SSLeay__X509_issuer_name':
    SSLeay.c:808: error: `X509' undeclared (first use in this function)
    SSLeay.c:808: error: `cert' undeclared (first use in this function)
    SSLeay.c:816: error: syntax error before ')' token
    SSLeay.xs:424: warning: assignment makes pointer from integer without a cast
    SSLeay.c: In function `XS_Crypt__SSLeay__X509_get_notBeforeString':
    SSLeay.c:838: error: `X509' undeclared (first use in this function)
    SSLeay.c:838: error: `cert' undeclared (first use in this function)
    SSLeay.c:844: error: syntax error before ')' token
    SSLeay.xs:434: error: invalid type argument of `->'
    SSLeay.c: In function `XS_Crypt__SSLeay__X509_get_notAfterString':
    SSLeay.c:863: error: `X509' undeclared (first use in this function)
    SSLeay.c:863: error: `cert' undeclared (first use in this function)
    SSLeay.c:869: error: syntax error before ')' token
    SSLeay.xs:442: error: invalid type argument of `->'
    make: *** [SSLeay.o] Error 1
    /usr/bin/make -- NOT OK
    Running make test
    Can't test without successful make
    Running make install
    make had returned bad status, install seems impossible

  10. #20
    arnieboy Guest

    Re: HOWTO: nifty gmail checker (checkgmail)

    looks like a dependency problem to me. are u sure u have openssl installed? to double check do a:
    Code:
    sudo apt-get install openssl libssl-dev
    and try to compile the SSLeay module again. when it asks for the OpenSSL path type:
    /usr/include/openssl
    Hope this helps.
    Last edited by arnieboy; August 28th, 2005 at 03:21 AM.

Page 2 of 16 FirstFirst 123412 ... LastLast

Bookmarks

Posting Permissions

  • You may not post new threads
  • You may not post replies
  • You may not post attachments
  • You may not edit your posts
  •