Quote Originally Posted by plecebo.mc View Post
i was compiling the source but after all iv done im stuck at the make command


this is where it trips up on me and because of this it fails:
.
.
.
19%] Building CXX object CMakeFiles/spark.dir/backends/decoder.cpp.o
/home/matt/Downloads/lightspark-0.4.6.1/backends/decoder.cpp: In member function ‘virtual bool lightspark::FFMpegVideoDecoder::decodeData(uint8_t *, uint32_t, uint32_t)’:
/home/matt/Downloads/lightspark-0.4.6.1/backends/decoder.cpp:232: warning: comparison between signed and unsigned integer expressions
[ 20%] Building CXX object CMakeFiles/spark.dir/backends/extscriptobject.cpp.o
.
.
[ 36%] Building CXX object CMakeFiles/spark.dir/parsing/amf3_generator.cpp.o
.
(it spazzes out here but i copied the last 3 lines if you need me to i could figure out how to post a log up too)
.
make[2]: *** [CMakeFiles/spark.dir/parsing/amf3_generator.cpp.o] Error 1
make[1]: *** [CMakeFiles/spark.dir/all] Error 2
make: *** [all] Error 2

______________
im running an ibook g4 ppc with ubuntu 10.04 LTS
im using lightspark-0.4.6.1

can any one help me out here ?

upgrade to 11.04 natty narwhal , and you can install it from the repositories like this:
in natty narwhal just do sudo apt-get install browser-plugin-lightspark for the browser plugin in terminal . and do sudo apt-get install lightspark in terminal to get the player.