View Full Version : compiling ogre....

January 25th, 2007, 07:07 PM
/usr/bin/ld: cannot find -lXaw
collect2: ld returned 1 exit status
make[3]: *** [libOgrePlatform.la] Error 1
make[3]: Leaving directory `/home/richard/Desktop/ogrenew/PlatformManagers/GLX/src'
make[2]: *** [all-recursive] Error 1
make[2]: Leaving directory `/home/richard/Desktop/ogrenew/PlatformManagers/GLX'
make[1]: *** [all-recursive] Error 1
make[1]: Leaving directory `/home/richard/Desktop/ogrenew/PlatformManagers'
make: *** [all-recursive] Error 1

i fixed various dependencies when doing ./configure, but now i am trying to make it i get this error. the weird bit is that i remember installing libxaw-dev, but yet its still giving me this error...

January 25th, 2007, 10:05 PM
There are two Athena dev packages in the repos, libxaw7-dev and libxaw6-dev; maybe you installed the wrong one?