Results 1 to 4 of 4

Thread: Flock not Flocking to my Approval

  1. #1
    Join Date
    May 2005
    Location
    Fremont, California, USA
    Beans
    330
    Distro
    Ubuntu 6.10 Edgy

    Flock not Flocking to my Approval

    +++ making chrome /home/kvidell/source/flock-source-0.4.10-complete/mozilla/browser/components/flock/tabs => ../../../../dist/bin/chrome/browser.jar
    +++ overriding content/browser/flock/tabs/tabsOverlay.xul content/browser/flock/tabs/tabsOverlay.css content/browser/flock/tabs/tabs.xml content/browser/flock/tabs/close.png content/browser/flock/tabs/close_active.png content/browser/flock/tabs/close_inactive.png content/browser/flock/tabs/close_hover.png
    updating: content/browser/flock/tabs/tabsOverlay.xul (stored 0%)
    updating: content/browser/flock/tabs/tabsOverlay.css (stored 0%)
    updating: content/browser/flock/tabs/tabs.xml (stored 0%)
    updating: content/browser/flock/tabs/close.png (stored 0%)
    updating: content/browser/flock/tabs/close_active.png (stored 0%)
    updating: content/browser/flock/tabs/close_inactive.png (stored 0%)
    updating: content/browser/flock/tabs/close_hover.png (stored 0%)
    make[5]: Leaving directory `/home/kvidell/source/flock-source-0.4.10-complete/mozilla/browser/components/flock/tabs'
    make[5]: Entering directory `/home/kvidell/source/flock-source-0.4.10-complete/mozilla/browser/components/flock/lucene'
    make[6]: Entering directory `/home/kvidell/source/flock-source-0.4.10-complete/mozilla/browser/components/flock/lucene/src'
    make[6]: *** No rule to make target `../../../../../../local/lib/libclucene.a', needed by `libxpcomclucene.so'. Stop.
    make[6]: Leaving directory `/home/kvidell/source/flock-source-0.4.10-complete/mozilla/browser/components/flock/lucene/src'
    make[5]: *** [libs] Error 2
    make[5]: Leaving directory `/home/kvidell/source/flock-source-0.4.10-complete/mozilla/browser/components/flock/lucene'
    make[4]: *** [libs] Error 2
    make[4]: Leaving directory `/home/kvidell/source/flock-source-0.4.10-complete/mozilla/browser/components/flock'
    make[3]: *** [libs] Error 2
    make[3]: Leaving directory `/home/kvidell/source/flock-source-0.4.10-complete/mozilla/browser/components'
    make[2]: *** [libs] Error 2
    make[2]: Leaving directory `/home/kvidell/source/flock-source-0.4.10-complete/mozilla/browser'
    make[1]: *** [tier_99] Error 2
    make[1]: Leaving directory `/home/kvidell/source/flock-source-0.4.10-complete/mozilla'
    make: *** [default] Error 2
    Any ideas? :-\ I don't understand the output.

    Anything else I should paste to help?
    - Kev
    Reg. Linux User #389145
    ThinkPad T42p running Breezy (with [Multi/Uni]verse, Marillat, Sarge, Cipherphunk and BMPx repos). All (sub)systems are a GO.
    Kill all the Spiders to save the Butterflies. Is this what we call Eden?
    Last.FM

  2. #2
    Join Date
    Sep 2005
    Beans
    16

    Re: Flock not Flocking to my Approval

    Looks like a problem in the Makefile for Lucene.

    I'll take a look when this finishes compiling.

  3. #3
    Join Date
    Nov 2005
    Location
    Allentown, PA
    Beans
    123
    Distro
    Ubuntu 12.04 Precise Pangolin

    Re: Flock not Flocking to my Approval

    Since this post, flock has moved from 0.4 to 0.7. Has anyone tried the updated version? Is there a package for it somewhere?

  4. #4
    Join Date
    Sep 2005
    Beans
    16

    Re: Flock not Flocking to my Approval

    I've taken Flock 0.7 for test drive and it's working out really well.

Bookmarks

Posting Permissions

  • You may not post new threads
  • You may not post replies
  • You may not post attachments
  • You may not edit your posts
  •