Page 1 of 3 123 LastLast
Results 1 to 10 of 26

Thread: Anyone got 2.6.30rc1 working properly?

  1. #1
    Join Date
    Feb 2007
    Beans
    192

    Thumbs down Anyone got 2.6.30rc1 working properly?

    http://kernel.ubuntu.com/~kernel-ppa/mainline/
    Tried it, but can't install the latest nvidia 173 driver...back to 2.6.29...

  2. #2
    Join Date
    Mar 2007
    Location
    Hempstead, NY
    Beans
    1,694
    Distro
    Ubuntu Development Release

    Re: Anyone got 2.6.30rc1 working properly?

    Intel wireless (iwl3945) seems to be broken.

  3. #3
    Join Date
    Sep 2006
    Location
    Central Europe
    Beans
    Hidden!
    Distro
    Ubuntu Development Release

    Re: Anyone got 2.6.30rc1 working properly?

    Unload and reload it - should work.
    The Power User’s Guide to Unity
    Questions about Ubuntu? Ask them at askubuntu.com!

  4. #4
    Join Date
    Sep 2008
    Beans
    796

    Re: Anyone got 2.6.30rc1 working properly?

    Not working for me unfortunately:

    Code:
    paul@jaunty-sdb:~/2.6.30$ cat /var/lib/dkms/nvidia/185.19/build/make.log
    DKMS make.log for nvidia-185.19 for kernel 2.6.30-020630rc1-generic (i686)
    Sat Apr 11 17:02:33 BST 2009
    NVIDIA: calling KBUILD...
    make CC=cc  KBUILD_VERBOSE=1 -C /lib/modules/2.6.30-020630rc1-generic/build SUBDIRS=/var/lib/dkms/nvidia/185.19/build modules
    test -e include/linux/autoconf.h -a -e include/config/auto.conf || (		\
    	echo;								\
    	echo "  ERROR: Kernel configuration is invalid.";		\
    	echo "         include/linux/autoconf.h or include/config/auto.conf are missing.";	\
    	echo "         Run 'make oldconfig && make prepare' on kernel src to fix it.";	\
    	echo;								\
    	/bin/false)
    mkdir -p /var/lib/dkms/nvidia/185.19/build/.tmp_versions ; rm -f /var/lib/dkms/nvidia/185.19/build/.tmp_versions/*
    make -f scripts/Makefile.build obj=/var/lib/dkms/nvidia/185.19/build
      cc -Wp,-MD,/var/lib/dkms/nvidia/185.19/build/.nv.o.d  -nostdinc -isystem /usr/lib/gcc/i486-linux-gnu/4.3.3/include -Iinclude  -I/usr/src/linux-headers-2.6.30-020630rc1-generic/arch/x86/include -include include/linux/autoconf.h -D__KERNEL__ -Wall -Wundef -Wstrict-prototypes -Wno-trigraphs -fno-strict-aliasing -fno-common -Werror-implicit-function-declaration -O2 -m32 -msoft-float -mregparm=3 -freg-struct-return -mpreferred-stack-boundary=2 -march=i586 -mtune=generic -Wa,-mtune=generic32 -ffreestanding -DCONFIG_AS_CFI=1 -DCONFIG_AS_CFI_SIGNAL_FRAME=1 -pipe -Wno-sign-compare -fno-asynchronous-unwind-tables -mno-sse -mno-mmx -mno-sse2 -mno-3dnow -fno-stack-protector -fno-omit-frame-pointer -fno-optimize-sibling-calls -Wdeclaration-after-statement -Wno-pointer-sign -fwrapv -I/var/lib/dkms/nvidia/185.19/build -Wall -Wimplicit -Wreturn-type -Wswitch -Wformat -Wchar-subscripts -Wparentheses -Wpointer-arith -Wno-multichar -Werror -MD -Wsign-compare -Wno-cast-qual -Wno-error -D__KERNEL__ -DMODULE -DNVRM -DNV_VERSION_STRING=\"185.19\" -UDEBUG -U_DEBUG -DNDEBUG  -DMODULE -D"KBUILD_STR(s)=#s" -D"KBUILD_BASENAME=KBUILD_STR(nv)"  -D"KBUILD_MODNAME=KBUILD_STR(nvidia)"  -c -o /var/lib/dkms/nvidia/185.19/build/.tmp_nv.o /var/lib/dkms/nvidia/185.19/build/nv.c
    In file included from include/linux/bitops.h:17,
                     from include/linux/kernel.h:15,
                     from include/linux/sched.h:52,
                     from include/linux/utsname.h:35,
                     from /var/lib/dkms/nvidia/185.19/build/nv-linux.h:19,
                     from /var/lib/dkms/nvidia/185.19/build/nv.c:14:
    /usr/src/linux-headers-2.6.30-020630rc1-generic/arch/x86/include/asm/bitops.h: In function ‘set_bit’:
    /usr/src/linux-headers-2.6.30-020630rc1-generic/arch/x86/include/asm/bitops.h:64: warning: pointer of type ‘void *’ used in arithmetic
    /usr/src/linux-headers-2.6.30-020630rc1-generic/arch/x86/include/asm/bitops.h: In function ‘clear_bit’:
    /usr/src/linux-headers-2.6.30-020630rc1-generic/arch/x86/include/asm/bitops.h:102: warning: pointer of type ‘void *’ used in arithmetic
    /usr/src/linux-headers-2.6.30-020630rc1-generic/arch/x86/include/asm/bitops.h: In function ‘change_bit’:
    /usr/src/linux-headers-2.6.30-020630rc1-generic/arch/x86/include/asm/bitops.h:178: warning: pointer of type ‘void *’ used in arithmetic
    In file included from include/linux/list.h:6,
                     from include/linux/preempt.h:11,
                     from include/linux/spinlock.h:50,
                     from include/linux/seqlock.h:29,
                     from include/linux/time.h:8,
                     from include/linux/timex.h:56,
                     from include/linux/sched.h:54,
                     from include/linux/utsname.h:35,
                     from /var/lib/dkms/nvidia/185.19/build/nv-linux.h:19,
                     from /var/lib/dkms/nvidia/185.19/build/nv.c:14:
    include/linux/prefetch.h: In function ‘prefetch_range’:
    include/linux/prefetch.h:57: warning: pointer of type ‘void *’ used in arithmetic
    In file included from include/linux/utsname.h:35,
                     from /var/lib/dkms/nvidia/185.19/build/nv-linux.h:19,
                     from /var/lib/dkms/nvidia/185.19/build/nv.c:14:
    include/linux/sched.h: In function ‘object_is_on_stack’:
    include/linux/sched.h:2119: warning: pointer of type ‘void *’ used in arithmetic
    In file included from include/linux/io.h:22,
                     from include/linux/pci.h:54,
                     from /var/lib/dkms/nvidia/185.19/build/nv-linux.h:86,
                     from /var/lib/dkms/nvidia/185.19/build/nv.c:14:
    /usr/src/linux-headers-2.6.30-020630rc1-generic/arch/x86/include/asm/io.h: In function ‘writeq’:
    /usr/src/linux-headers-2.6.30-020630rc1-generic/arch/x86/include/asm/io.h:70: warning: pointer of type ‘void *’ used in arithmetic
    In file included from include/linux/dma-mapping.h:7,
                     from include/asm-generic/pci-dma-compat.h:7,
                     from /usr/src/linux-headers-2.6.30-020630rc1-generic/arch/x86/include/asm/pci.h:129,
                     from include/linux/pci.h:1098,
                     from /var/lib/dkms/nvidia/185.19/build/nv-linux.h:86,
                     from /var/lib/dkms/nvidia/185.19/build/nv.c:14:
    include/linux/scatterlist.h: In function ‘sg_virt’:
    include/linux/scatterlist.h:199: warning: pointer of type ‘void *’ used in arithmetic
    In file included from /var/lib/dkms/nvidia/185.19/build/nv-linux.h:113,
                     from /var/lib/dkms/nvidia/185.19/build/nv.c:14:
    include/linux/highmem.h: In function ‘zero_user_segments’:
    include/linux/highmem.h:147: warning: pointer of type ‘void *’ used in arithmetic
    include/linux/highmem.h:147: warning: pointer of type ‘void *’ used in arithmetic
    include/linux/highmem.h:147: warning: pointer of type ‘void *’ used in arithmetic
    include/linux/highmem.h:147: warning: pointer of type ‘void *’ used in arithmetic
    include/linux/highmem.h:150: warning: pointer of type ‘void *’ used in arithmetic
    include/linux/highmem.h:150: warning: pointer of type ‘void *’ used in arithmetic
    include/linux/highmem.h:150: warning: pointer of type ‘void *’ used in arithmetic
    include/linux/highmem.h:150: warning: pointer of type ‘void *’ used in arithmetic
    /var/lib/dkms/nvidia/185.19/build/nv.c: In function ‘nvos_proc_create’:
    /var/lib/dkms/nvidia/185.19/build/nv.c:591: error: ‘struct proc_dir_entry’ has no member named ‘owner’
    /var/lib/dkms/nvidia/185.19/build/nv.c:592: error: ‘struct proc_dir_entry’ has no member named ‘owner’
    /var/lib/dkms/nvidia/185.19/build/nv.c:593: error: ‘struct proc_dir_entry’ has no member named ‘owner’
    /var/lib/dkms/nvidia/185.19/build/nv.c:613: error: ‘struct proc_dir_entry’ has no member named ‘owner’
    /var/lib/dkms/nvidia/185.19/build/nv.c:627: error: ‘struct proc_dir_entry’ has no member named ‘owner’
    /var/lib/dkms/nvidia/185.19/build/nv.c:638: error: ‘struct proc_dir_entry’ has no member named ‘owner’
    /var/lib/dkms/nvidia/185.19/build/nv.c:648: error: ‘struct proc_dir_entry’ has no member named ‘owner’
    /var/lib/dkms/nvidia/185.19/build/nv.c:658: error: ‘struct proc_dir_entry’ has no member named ‘owner’
    /var/lib/dkms/nvidia/185.19/build/nv.c:669: error: ‘struct proc_dir_entry’ has no member named ‘owner’
    /var/lib/dkms/nvidia/185.19/build/nv.c:676: error: ‘struct proc_dir_entry’ has no member named ‘owner’
    /var/lib/dkms/nvidia/185.19/build/nv.c: In function ‘nvos_proc_add_warning_file’:
    /var/lib/dkms/nvidia/185.19/build/nv.c:703: error: ‘struct proc_dir_entry’ has no member named ‘owner’
    make[3]: *** [/var/lib/dkms/nvidia/185.19/build/nv.o] Error 1
    make[2]: *** [_module_/var/lib/dkms/nvidia/185.19/build] Error 2
    NVIDIA: left KBUILD.
    nvidia.ko failed to build!
    make[1]: *** [module] Error 1
    make: *** [module] Error 2
    paul@jaunty-sdb:~/2.6.30$

  5. #5
    Join Date
    Nov 2006
    Location
    Sweden
    Beans
    2,594
    Distro
    Ubuntu Development Release

    Re: Anyone got 2.6.30rc1 working properly?

    [QUOTE]
    Quote Originally Posted by paul_in_london View Post
    Not working for me unfortunately:
    You must patch the nVidia driver

    Message No 5

    http://www.nvnews.net/vbulletin/showthread.php?t=131138


  6. #6
    Join Date
    Feb 2008
    Location
    Kingston upon Hull
    Beans
    Hidden!
    Distro
    Ubuntu Development Release

    Re: Anyone got 2.6.30rc1 working properly?

    Doesn't work for me, I get up to GDM but can't log in or do anything else.

  7. #7
    Join Date
    Nov 2006
    Location
    Sweden
    Beans
    2,594
    Distro
    Ubuntu Development Release

    Re: Anyone got 2.6.30rc1 working properly?

    Quote Originally Posted by lee.jarratt View Post
    Doesn't work for me, I get up to GDM but can't log in or do anything else.
    Well it works....

    sudo sh for Ubuntu.

  8. #8
    Join Date
    Sep 2008
    Beans
    796

    Re: Anyone got 2.6.30rc1 working properly?

    Hmm. Thanks Plun.

    I didn't have this problem with 2.6.29.1 though.

    I was able to upgrade seamlessly to 185.19 via https://launchpad.net/~thefirstm/+archive/ppa without any problems when I was already running 2.6.29.1

    I didn't use the Nvidia installer and I didn't need to patch anything, but the page you pointed me to talks about the need to patch for 2.6.29 as well as 2.6.30

    Is there a way to get it to work without using the Nvidia installer?

  9. #9
    Join Date
    Nov 2006
    Location
    Sweden
    Beans
    2,594
    Distro
    Ubuntu Development Release

    Re: Anyone got 2.6.30rc1 working properly?

    Quote Originally Posted by paul_in_london View Post
    Is there a way to get it to work without using the Nvidia installer?
    Nope, I cannot find anyway using a repo
    The problem is "owner" during install and it must be patched.

    after you have patched you will have a new custom package to install with sudo sh.

  10. #10
    Join Date
    Apr 2006
    Location
    Rochester, N.Y.
    Beans
    Hidden!
    Distro
    Xubuntu Development Release

    Re: Anyone got 2.6.30rc1 working properly?

    Not to "hijack" thread, but does .30 work with 'fglrx'' ATI, as .29 doesn't?
    (Was)Windows Free At Last
    "May You Have A Safe Trip and A Successful Journey"
    Linux user #432153 Ubuntu user #8521

Page 1 of 3 123 LastLast

Bookmarks

Posting Permissions

  • You may not post new threads
  • You may not post replies
  • You may not post attachments
  • You may not edit your posts
  •