Results 1 to 3 of 3

Thread: Compile SPLAT RF Signal Propagation, Loss, And Terrain

  1. #1
    Join Date
    Mar 2011
    Beans
    1
    Distro
    Ubuntu 10.04 Lucid Lynx

    Question Compile SPLAT RF Signal Propagation, Loss, And Terrain

    Can't get it to compile properly

    Equipment: Macbookpro1,1

    Platform: ubuntu 10.04 LTS

    output:

    thor@thor:~/Desktop/splat-1.3.0$ ./configure


    ************************************************** ****
    ** SPLAT! Standard Resolution Mode Configuration **
    ************************************************** ****

    Please select the Maximum Analysis Region capability
    you would like SPLAT! to possess when operating in
    3 arc-second (standard) resolution mode based on
    your available memory resources:

    Maximum Analysis Region RAM + Swap Requirement
    ================================================== ==

    (2) 2 x 2 Degrees --------- 25 Megabytes minimum
    (3) 3 x 3 Degrees --------- 52 Megabytes minimum
    (4) 4 x 4 Degrees --------- 95 Megabytes minimum
    (5) 5 x 5 Degrees --------- 145 Megabytes minimum
    (6) 6 x 6 Degrees --------- 210 Megabytes minimum
    (7) 7 x 7 Degrees --------- 285 Megabytes minimum
    (8) 8 x 8 Degrees --------- 370 Megabytes minimum

    Your choice: 8



    ************************************************** ****
    ** SPLAT! HD High Resolution Mode Configuration **
    ************************************************** ****

    Please select the Maximum Analysis Region capability
    you would like SPLAT! to possess when operating in
    1 arc-second (HD) resolution mode based on your
    available memory resources (select 8x8 with caution):

    Maximum Analysis Region RAM + Swap Requirement
    ================================================== ==

    (1) 1 x 1 Degrees --------- 52 Megabytes minimum
    (2) 2 x 2 Degrees --------- 225 Megabytes minimum
    (3) 3 x 3 Degrees --------- 468 Megabytes minimum
    (4) 4 x 4 Degrees --------- 855 Megabytes minimum
    (5) 5 x 5 Degrees --------- 1305 Megabytes minimum
    (6) 6 x 6 Degrees --------- 1890 Megabytes minimum
    (7) 7 x 7 Degrees --------- 2565 Megabytes minimum
    (8) 8 x 8 Degrees --------- 3330 Megabytes minimum
    (0) None of the above. Do not build SPLAT! HD.

    Your choice: 8



    ************************************************** ***
    * Now building SPLAT! and associated utilities... *
    ************************************************** ***

    Compiling SPLAT!... In file included from /usr/include/string.h:640,
    from splat.cpp:28:
    In function ,
    inlined from at splat.cpp:1663:
    /usr/include/bits/string3.h:154: warning: call to char* __builtin___strncat_chk(char*, const char*, unsigned int, unsigned int) might overflow destination buffer
    In function :
    /usr/include/bits/string3.h:154: warning: call to char* __builtin___strncat_chk(char*, const char*, unsigned int, unsigned int) might overflow destination buffer
    In function ,
    inlined from at splat.cpp:1896:
    /usr/include/bits/string3.h:154: warning: call to char* __builtin___strncat_chk(char*, const char*, unsigned int, unsigned int) might overflow destination buffer
    In function :
    /usr/include/bits/string3.h:154: warning: call to char* __builtin___strncat_chk(char*, const char*, unsigned int, unsigned int) might overflow destination buffer
    Done!
    Compiling SPLAT! HD... splat.cpp:159: error: size of array is too large
    splat.cpp: In function :
    splat.cpp:285: error: expected primary-expression before token
    splat.cpp:286: error: expected primary-expression before token
    splat.cpp:296: error: expected unqualified-id before token
    splat.cpp:297: error: expected primary-expression before token
    splat.cpp: In function :
    splat.cpp:317: error: expected primary-expression before token
    splat.cpp:318: error: expected primary-expression before token
    splat.cpp:328: error: expected unqualified-id before token
    splat.cpp:329: error: expected primary-expression before token
    splat.cpp: In function :
    splat.cpp:354: error: expected primary-expression before token
    splat.cpp:355: error: expected primary-expression before token
    splat.cpp:365: error: expected unqualified-id before token
    splat.cpp:366: error: expected primary-expression before token
    splat.cpp: In function :
    splat.cpp:384: error: expected primary-expression before token
    splat.cpp:385: error: expected primary-expression before token
    splat.cpp:394: error: expected primary-expression before token
    splat.cpp: In function :
    splat.cpp:411: error: expected primary-expression before token
    splat.cpp:412: error: expected primary-expression before token
    splat.cpp:421: error: expected primary-expression before token
    splat.cpp: In function :
    splat.cpp:440: error: expected primary-expression before token
    splat.cpp:441: error: expected primary-expression before token
    splat.cpp:450: error: expected unqualified-id before token
    splat.cpp: In function :
    splat.cpp:1634: error: expected primary-expression before token
    splat.cpp:1634: error: expected primary-expression before token
    splat.cpp:1634: error: expected primary-expression before token
    splat.cpp:1634: error: expected primary-expression before token
    splat.cpp:1643: error: expected primary-expression before token
    splat.cpp:1674: error: expected primary-expression before token
    splat.cpp:1677: error: expected primary-expression before token
    splat.cpp:1680: error: expected primary-expression before token
    splat.cpp:1683: error: expected primary-expression before token
    splat.cpp:1691: error: expected unqualified-id before token
    splat.cpp:1692: error: expected unqualified-id before token
    splat.cpp:1693: error: expected unqualified-id before token
    splat.cpp:1695: error: expected primary-expression before token
    splat.cpp:1696: error: expected unqualified-id before token
    splat.cpp:1698: error: expected primary-expression before token
    splat.cpp:1699: error: expected unqualified-id before token
    splat.cpp:1704: error: expected primary-expression before token
    splat.cpp:1705: error: expected primary-expression before token
    splat.cpp:1707: error: expected primary-expression before token
    splat.cpp:1708: error: expected primary-expression before token
    splat.cpp:1711: error: expected primary-expression before token
    splat.cpp:1713: error: expected primary-expression before token
    splat.cpp:1714: error: expected primary-expression before token
    splat.cpp:1717: error: expected primary-expression before token
    splat.cpp:1719: error: expected primary-expression before token
    splat.cpp:1720: error: expected primary-expression before token
    splat.cpp:1723: error: expected primary-expression before token
    splat.cpp:1727: error: expected primary-expression before token
    splat.cpp:1729: error: expected primary-expression before token
    splat.cpp:1730: error: expected primary-expression before token
    splat.cpp:1735: error: expected primary-expression before token
    splat.cpp:1736: error: expected primary-expression before token
    splat.cpp:1741: error: expected primary-expression before token
    splat.cpp:1745: error: expected primary-expression before token
    splat.cpp:1747: error: expected primary-expression before token
    splat.cpp:1748: error: expected primary-expression before token
    splat.cpp:1753: error: expected primary-expression before token
    splat.cpp:1754: error: expected primary-expression before token
    splat.cpp: In function :
    splat.cpp:1866: error: expected primary-expression before token
    splat.cpp:1866: error: expected primary-expression before token
    splat.cpp:1866: error: expected primary-expression before token
    splat.cpp:1866: error: expected primary-expression before token
    splat.cpp:1875: error: expected primary-expression before token
    splat.cpp:1907: error: expected primary-expression before token
    splat.cpp:1908: error: expected primary-expression before token
    splat.cpp:1909: error: expected primary-expression before token
    splat.cpp:1910: error: expected primary-expression before token
    splat.cpp:1918: error: expected unqualified-id before token
    splat.cpp:1919: error: expected unqualified-id before token
    splat.cpp:1920: error: expected unqualified-id before token
    splat.cpp:1922: error: expected primary-expression before token
    splat.cpp:1923: error: expected unqualified-id before token
    splat.cpp:1925: error: expected primary-expression before token
    splat.cpp:1926: error: expected unqualified-id before token
    splat.cpp:1933: error: expected primary-expression before token
    splat.cpp:1934: error: expected primary-expression before token
    splat.cpp:1936: error: expected primary-expression before token
    splat.cpp:1937: error: expected primary-expression before token
    splat.cpp:1940: error: expected primary-expression before token
    splat.cpp:1942: error: expected primary-expression before token
    splat.cpp:1943: error: expected primary-expression before token
    splat.cpp:1946: error: expected primary-expression before token
    splat.cpp:1948: error: expected primary-expression before token
    splat.cpp:1949: error: expected primary-expression before token
    splat.cpp:1952: error: expected primary-expression before token
    splat.cpp:1956: error: expected primary-expression before token
    splat.cpp:1958: error: expected primary-expression before token
    splat.cpp:1959: error: expected primary-expression before token
    splat.cpp:1964: error: expected primary-expression before token
    splat.cpp:1965: error: expected primary-expression before token
    splat.cpp:1970: error: expected primary-expression before token
    splat.cpp:1974: error: expected primary-expression before token
    splat.cpp:1976: error: expected primary-expression before token
    splat.cpp:1977: error: expected primary-expression before token
    splat.cpp:1982: error: expected primary-expression before token
    splat.cpp:1983: error: expected primary-expression before token
    splat.cpp: In function :
    splat.cpp:2037: error: expected primary-expression before token
    splat.cpp:2037: error: expected primary-expression before token
    splat.cpp:2037: error: expected primary-expression before token
    splat.cpp:2037: error: expected primary-expression before token
    splat.cpp:2046: error: expected primary-expression before token
    splat.cpp:2057: error: expected unqualified-id before token
    splat.cpp:2058: error: expected unqualified-id before token
    splat.cpp:2059: error: expected unqualified-id before token
    splat.cpp:2060: error: expected unqualified-id before token
    splat.cpp:2067: error: expected unqualified-id before token
    splat.cpp:2068: error: expected unqualified-id before token
    splat.cpp:2069: error: expected unqualified-id before token
    splat.cpp:2071: error: expected primary-expression before token
    splat.cpp:2072: error: expected unqualified-id before token
    splat.cpp:2075: error: expected primary-expression before token
    splat.cpp:2076: error: expected primary-expression before token
    splat.cpp:2078: error: expected primary-expression before token
    splat.cpp:2079: error: expected primary-expression before token
    splat.cpp:2082: error: expected primary-expression before token
    splat.cpp:2084: error: expected primary-expression before token
    splat.cpp:2085: error: expected primary-expression before token
    splat.cpp:2088: error: expected primary-expression before token
    splat.cpp:2090: error: expected primary-expression before token
    splat.cpp:2091: error: expected primary-expression before token
    splat.cpp:2094: error: expected primary-expression before token
    splat.cpp:2098: error: expected primary-expression before token
    splat.cpp:2100: error: expected primary-expression before token
    splat.cpp:2101: error: expected primary-expression before token
    splat.cpp:2106: error: expected primary-expression before token
    splat.cpp:2107: error: expected primary-expression before token
    splat.cpp:2112: error: expected primary-expression before token
    splat.cpp:2116: error: expected primary-expression before token
    splat.cpp:2118: error: expected primary-expression before token
    splat.cpp:2119: error: expected primary-expression before token
    splat.cpp:2124: error: expected primary-expression before token
    splat.cpp:2125: error: expected primary-expression before token
    splat.cpp: In function :
    splat.cpp:3980: error: expected primary-expression before token
    splat.cpp:3981: error: expected primary-expression before token
    splat.cpp:3991: error: expected primary-expression before token
    splat.cpp:4084: error: expected primary-expression before token
    splat.cpp:4089: error: expected primary-expression before token
    splat.cpp: In function :
    splat.cpp:4275: error: expected primary-expression before token
    splat.cpp:4276: error: expected primary-expression before token
    splat.cpp:4286: error: expected primary-expression before token
    splat.cpp:4287: error: expected primary-expression before token
    splat.cpp:4345: error: expected primary-expression before token
    splat.cpp:4349: error: expected primary-expression before token
    splat.cpp:4364: error: expected primary-expression before token
    splat.cpp:4369: error: expected primary-expression before token
    splat.cpp: In function :
    splat.cpp:4627: error: expected primary-expression before token
    splat.cpp:4628: error: expected primary-expression before token
    splat.cpp:4638: error: expected primary-expression before token
    splat.cpp:4639: error: expected primary-expression before token
    splat.cpp:4697: error: expected primary-expression before token
    splat.cpp:4701: error: expected primary-expression before token
    splat.cpp:4720: error: expected primary-expression before token
    splat.cpp:4725: error: expected primary-expression before token
    splat.cpp: In function :
    splat.cpp:5000: error: expected primary-expression before token
    splat.cpp:5001: error: expected primary-expression before token
    splat.cpp:5011: error: expected primary-expression before token
    splat.cpp:5012: error: expected primary-expression before token
    splat.cpp:5070: error: expected primary-expression before token
    splat.cpp:5074: error: expected primary-expression before token
    splat.cpp:5093: error: expected primary-expression before token
    splat.cpp:5098: error: expected primary-expression before token
    splat.cpp: In function :
    splat.cpp:7355: error: expected unqualified-id before token
    splat.cpp:7356: error: expected unqualified-id before token
    splat.cpp:7357: error: expected unqualified-id before token
    splat.cpp:7358: error: expected unqualified-id before token
    splat.cpp:7359: error: expected unqualified-id before token
    splat.cpp:7360: error: expected unqualified-id before token
    Compilation failed!
    Compiling citydecoder... Done!
    Compiling usgs2sdf... Done!
    Compiling srtm2sdf... In file included from /usr/include/string.h:640,
    from srtm2sdf.c:15:
    In function ,
    inlined from at srtm2sdf.c:264:
    /usr/include/bits/string3.h:154: warning: call to __builtin___strncat_chk might overflow destination buffer
    In function ,
    inlined from at srtm2sdf.c:371:
    /usr/include/bits/string3.h:154: warning: call to __builtin___strncat_chk might overflow destination buffer
    Done!
    Compiling fontdata... fontdata.c:34:18: error: zlib.h: No such file or directory
    fontdata.c: In function :
    fontdata.c:45: warning: implicit declaration of function
    fontdata.c:45: warning: assignment makes pointer from integer without a cast
    fontdata.c:61: warning: implicit declaration of function
    fontdata.c:78: warning: implicit declaration of function
    Compilation failed!
    Compiling bearing... Done!

    To install SPLAT! and its associated utilities, please
    su to 'root' and execute the install script as follows:

    ./install all

    Don't forget to read the documentation under the docs directory
    as well as the various README files in the splat and splat/utils
    directories. Enjoy the program! John, KD2BD


    thor@thor:~/Desktop/splat-1.3.0$

  2. #2
    Join Date
    Nov 2009
    Location
    East Anglia
    Beans
    415
    Distro
    Xubuntu

    Re: Compile SPLAT RF Signal Propagation, Loss, And Terrain

    Quote Originally Posted by KE4DDE View Post
    Can't get it to compile properly

    Equipment: Macbookpro1,1

    Platform: ubuntu 10.04 LTS

    ... snip ...
    Why not just install it from launchpad:

    https://launchpad.net/ubuntu/+source...3.0-1_i386.deb

    H

  3. #3
    Join Date
    Mar 2012
    Beans
    1

    Re: Compile SPLAT RF Signal Propagation, Loss, And Terrain

    Quote Originally Posted by KE4DDE View Post
    Can't get it to compile properly

    Equipment: Macbookpro1,1

    Platform: ubuntu 10.04 LTS

    output:

    thor@thor:~/Desktop/splat-1.3.0$ ./configure


    ************************************************** ****
    ** SPLAT! Standard Resolution Mode Configuration **
    ************************************************** ****

    Please select the Maximum Analysis Region capability
    you would like SPLAT! to possess when operating in
    3 arc-second (standard) resolution mode based on
    your available memory resources:

    Maximum Analysis Region RAM + Swap Requirement
    ================================================== ==

    (2) 2 x 2 Degrees --------- 25 Megabytes minimum
    (3) 3 x 3 Degrees --------- 52 Megabytes minimum
    (4) 4 x 4 Degrees --------- 95 Megabytes minimum
    (5) 5 x 5 Degrees --------- 145 Megabytes minimum
    (6) 6 x 6 Degrees --------- 210 Megabytes minimum
    (7) 7 x 7 Degrees --------- 285 Megabytes minimum
    (8) 8 x 8 Degrees --------- 370 Megabytes minimum

    Your choice: 8



    ************************************************** ****
    ** SPLAT! HD High Resolution Mode Configuration **
    ************************************************** ****

    Please select the Maximum Analysis Region capability
    you would like SPLAT! to possess when operating in
    1 arc-second (HD) resolution mode based on your
    available memory resources (select 8x8 with caution):

    Maximum Analysis Region RAM + Swap Requirement
    ================================================== ==

    (1) 1 x 1 Degrees --------- 52 Megabytes minimum
    (2) 2 x 2 Degrees --------- 225 Megabytes minimum
    (3) 3 x 3 Degrees --------- 468 Megabytes minimum
    (4) 4 x 4 Degrees --------- 855 Megabytes minimum
    (5) 5 x 5 Degrees --------- 1305 Megabytes minimum
    (6) 6 x 6 Degrees --------- 1890 Megabytes minimum
    (7) 7 x 7 Degrees --------- 2565 Megabytes minimum
    (8) 8 x 8 Degrees --------- 3330 Megabytes minimum
    (0) None of the above. Do not build SPLAT! HD.

    Your choice: 8



    ************************************************** ***
    * Now building SPLAT! and associated utilities... *
    ************************************************** ***

    Compiling SPLAT!... In file included from /usr/include/string.h:640,
    from splat.cpp:28:
    In function ,
    inlined from at splat.cpp:1663:
    /usr/include/bits/string3.h:154: warning: call to char* __builtin___strncat_chk(char*, const char*, unsigned int, unsigned int) might overflow destination buffer
    In function :
    /usr/include/bits/string3.h:154: warning: call to char* __builtin___strncat_chk(char*, const char*, unsigned int, unsigned int) might overflow destination buffer
    In function ,
    inlined from at splat.cpp:1896:
    /usr/include/bits/string3.h:154: warning: call to char* __builtin___strncat_chk(char*, const char*, unsigned int, unsigned int) might overflow destination buffer
    In function :
    /usr/include/bits/string3.h:154: warning: call to char* __builtin___strncat_chk(char*, const char*, unsigned int, unsigned int) might overflow destination buffer
    Done!
    Compiling SPLAT! HD... splat.cpp:159: error: size of array is too large
    splat.cpp: In function :
    splat.cpp:285: error: expected primary-expression before token
    splat.cpp:286: error: expected primary-expression before token
    splat.cpp:296: error: expected unqualified-id before token
    splat.cpp:297: error: expected primary-expression before token
    splat.cpp: In function :
    splat.cpp:317: error: expected primary-expression before token
    splat.cpp:318: error: expected primary-expression before token
    splat.cpp:328: error: expected unqualified-id before token
    splat.cpp:329: error: expected primary-expression before token
    splat.cpp: In function :
    splat.cpp:354: error: expected primary-expression before token
    splat.cpp:355: error: expected primary-expression before token
    splat.cpp:365: error: expected unqualified-id before token
    splat.cpp:366: error: expected primary-expression before token
    splat.cpp: In function :
    splat.cpp:384: error: expected primary-expression before token
    splat.cpp:385: error: expected primary-expression before token
    splat.cpp:394: error: expected primary-expression before token
    splat.cpp: In function :
    splat.cpp:411: error: expected primary-expression before token
    splat.cpp:412: error: expected primary-expression before token
    splat.cpp:421: error: expected primary-expression before token
    splat.cpp: In function :
    splat.cpp:440: error: expected primary-expression before token
    splat.cpp:441: error: expected primary-expression before token
    splat.cpp:450: error: expected unqualified-id before token
    splat.cpp: In function :
    splat.cpp:1634: error: expected primary-expression before token
    splat.cpp:1634: error: expected primary-expression before token
    splat.cpp:1634: error: expected primary-expression before token
    splat.cpp:1634: error: expected primary-expression before token
    splat.cpp:1643: error: expected primary-expression before token
    splat.cpp:1674: error: expected primary-expression before token
    splat.cpp:1677: error: expected primary-expression before token
    splat.cpp:1680: error: expected primary-expression before token
    splat.cpp:1683: error: expected primary-expression before token
    splat.cpp:1691: error: expected unqualified-id before token
    splat.cpp:1692: error: expected unqualified-id before token
    splat.cpp:1693: error: expected unqualified-id before token
    splat.cpp:1695: error: expected primary-expression before token
    splat.cpp:1696: error: expected unqualified-id before token
    splat.cpp:1698: error: expected primary-expression before token
    splat.cpp:1699: error: expected unqualified-id before token
    splat.cpp:1704: error: expected primary-expression before token
    splat.cpp:1705: error: expected primary-expression before token
    splat.cpp:1707: error: expected primary-expression before token
    splat.cpp:1708: error: expected primary-expression before token
    splat.cpp:1711: error: expected primary-expression before token
    splat.cpp:1713: error: expected primary-expression before token
    splat.cpp:1714: error: expected primary-expression before token
    splat.cpp:1717: error: expected primary-expression before token
    splat.cpp:1719: error: expected primary-expression before token
    splat.cpp:1720: error: expected primary-expression before token
    splat.cpp:1723: error: expected primary-expression before token
    splat.cpp:1727: error: expected primary-expression before token
    splat.cpp:1729: error: expected primary-expression before token
    splat.cpp:1730: error: expected primary-expression before token
    splat.cpp:1735: error: expected primary-expression before token
    splat.cpp:1736: error: expected primary-expression before token
    splat.cpp:1741: error: expected primary-expression before token
    splat.cpp:1745: error: expected primary-expression before token
    splat.cpp:1747: error: expected primary-expression before token
    splat.cpp:1748: error: expected primary-expression before token
    splat.cpp:1753: error: expected primary-expression before token
    splat.cpp:1754: error: expected primary-expression before token
    splat.cpp: In function :
    splat.cpp:1866: error: expected primary-expression before token
    splat.cpp:1866: error: expected primary-expression before token
    splat.cpp:1866: error: expected primary-expression before token
    splat.cpp:1866: error: expected primary-expression before token
    splat.cpp:1875: error: expected primary-expression before token
    splat.cpp:1907: error: expected primary-expression before token
    splat.cpp:1908: error: expected primary-expression before token
    splat.cpp:1909: error: expected primary-expression before token
    splat.cpp:1910: error: expected primary-expression before token
    splat.cpp:1918: error: expected unqualified-id before token
    splat.cpp:1919: error: expected unqualified-id before token
    splat.cpp:1920: error: expected unqualified-id before token
    splat.cpp:1922: error: expected primary-expression before token
    splat.cpp:1923: error: expected unqualified-id before token
    splat.cpp:1925: error: expected primary-expression before token
    splat.cpp:1926: error: expected unqualified-id before token
    splat.cpp:1933: error: expected primary-expression before token
    splat.cpp:1934: error: expected primary-expression before token
    splat.cpp:1936: error: expected primary-expression before token
    splat.cpp:1937: error: expected primary-expression before token
    splat.cpp:1940: error: expected primary-expression before token
    splat.cpp:1942: error: expected primary-expression before token
    splat.cpp:1943: error: expected primary-expression before token
    splat.cpp:1946: error: expected primary-expression before token
    splat.cpp:1948: error: expected primary-expression before token
    splat.cpp:1949: error: expected primary-expression before token
    splat.cpp:1952: error: expected primary-expression before token
    splat.cpp:1956: error: expected primary-expression before token
    splat.cpp:1958: error: expected primary-expression before token
    splat.cpp:1959: error: expected primary-expression before token
    splat.cpp:1964: error: expected primary-expression before token
    splat.cpp:1965: error: expected primary-expression before token
    splat.cpp:1970: error: expected primary-expression before token
    splat.cpp:1974: error: expected primary-expression before token
    splat.cpp:1976: error: expected primary-expression before token
    splat.cpp:1977: error: expected primary-expression before token
    splat.cpp:1982: error: expected primary-expression before token
    splat.cpp:1983: error: expected primary-expression before token
    splat.cpp: In function :
    splat.cpp:2037: error: expected primary-expression before token
    splat.cpp:2037: error: expected primary-expression before token
    splat.cpp:2037: error: expected primary-expression before token
    splat.cpp:2037: error: expected primary-expression before token
    splat.cpp:2046: error: expected primary-expression before token
    splat.cpp:2057: error: expected unqualified-id before token
    splat.cpp:2058: error: expected unqualified-id before token
    splat.cpp:2059: error: expected unqualified-id before token
    splat.cpp:2060: error: expected unqualified-id before token
    splat.cpp:2067: error: expected unqualified-id before token
    splat.cpp:2068: error: expected unqualified-id before token
    splat.cpp:2069: error: expected unqualified-id before token
    splat.cpp:2071: error: expected primary-expression before token
    splat.cpp:2072: error: expected unqualified-id before token
    splat.cpp:2075: error: expected primary-expression before token
    splat.cpp:2076: error: expected primary-expression before token
    splat.cpp:2078: error: expected primary-expression before token
    splat.cpp:2079: error: expected primary-expression before token
    splat.cpp:2082: error: expected primary-expression before token
    splat.cpp:2084: error: expected primary-expression before token
    splat.cpp:2085: error: expected primary-expression before token
    splat.cpp:2088: error: expected primary-expression before token
    splat.cpp:2090: error: expected primary-expression before token
    splat.cpp:2091: error: expected primary-expression before token
    splat.cpp:2094: error: expected primary-expression before token
    splat.cpp:2098: error: expected primary-expression before token
    splat.cpp:2100: error: expected primary-expression before token
    splat.cpp:2101: error: expected primary-expression before token
    splat.cpp:2106: error: expected primary-expression before token
    splat.cpp:2107: error: expected primary-expression before token
    splat.cpp:2112: error: expected primary-expression before token
    splat.cpp:2116: error: expected primary-expression before token
    splat.cpp:2118: error: expected primary-expression before token
    splat.cpp:2119: error: expected primary-expression before token
    splat.cpp:2124: error: expected primary-expression before token
    splat.cpp:2125: error: expected primary-expression before token
    splat.cpp: In function :
    splat.cpp:3980: error: expected primary-expression before token
    splat.cpp:3981: error: expected primary-expression before token
    splat.cpp:3991: error: expected primary-expression before token
    splat.cpp:4084: error: expected primary-expression before token
    splat.cpp:4089: error: expected primary-expression before token
    splat.cpp: In function :
    splat.cpp:4275: error: expected primary-expression before token
    splat.cpp:4276: error: expected primary-expression before token
    splat.cpp:4286: error: expected primary-expression before token
    splat.cpp:4287: error: expected primary-expression before token
    splat.cpp:4345: error: expected primary-expression before token
    splat.cpp:4349: error: expected primary-expression before token
    splat.cpp:4364: error: expected primary-expression before token
    splat.cpp:4369: error: expected primary-expression before token
    splat.cpp: In function :
    splat.cpp:4627: error: expected primary-expression before token
    splat.cpp:4628: error: expected primary-expression before token
    splat.cpp:4638: error: expected primary-expression before token
    splat.cpp:4639: error: expected primary-expression before token
    splat.cpp:4697: error: expected primary-expression before token
    splat.cpp:4701: error: expected primary-expression before token
    splat.cpp:4720: error: expected primary-expression before token
    splat.cpp:4725: error: expected primary-expression before token
    splat.cpp: In function :
    splat.cpp:5000: error: expected primary-expression before token
    splat.cpp:5001: error: expected primary-expression before token
    splat.cpp:5011: error: expected primary-expression before token
    splat.cpp:5012: error: expected primary-expression before token
    splat.cpp:5070: error: expected primary-expression before token
    splat.cpp:5074: error: expected primary-expression before token
    splat.cpp:5093: error: expected primary-expression before token
    splat.cpp:5098: error: expected primary-expression before token
    splat.cpp: In function :
    splat.cpp:7355: error: expected unqualified-id before token
    splat.cpp:7356: error: expected unqualified-id before token
    splat.cpp:7357: error: expected unqualified-id before token
    splat.cpp:7358: error: expected unqualified-id before token
    splat.cpp:7359: error: expected unqualified-id before token
    splat.cpp:7360: error: expected unqualified-id before token
    Compilation failed!
    Compiling citydecoder... Done!
    Compiling usgs2sdf... Done!
    Compiling srtm2sdf... In file included from /usr/include/string.h:640,
    from srtm2sdf.c:15:
    In function ,
    inlined from at srtm2sdf.c:264:
    /usr/include/bits/string3.h:154: warning: call to __builtin___strncat_chk might overflow destination buffer
    In function ,
    inlined from at srtm2sdf.c:371:
    /usr/include/bits/string3.h:154: warning: call to __builtin___strncat_chk might overflow destination buffer
    Done!
    Compiling fontdata... fontdata.c:34:18: error: zlib.h: No such file or directory
    fontdata.c: In function :
    fontdata.c:45: warning: implicit declaration of function
    fontdata.c:45: warning: assignment makes pointer from integer without a cast
    fontdata.c:61: warning: implicit declaration of function
    fontdata.c:78: warning: implicit declaration of function
    Compilation failed!
    Compiling bearing... Done!

    To install SPLAT! and its associated utilities, please
    su to 'root' and execute the install script as follows:

    ./install all

    Don't forget to read the documentation under the docs directory
    as well as the various README files in the splat and splat/utils
    directories. Enjoy the program! John, KD2BD


    thor@thor:~/Desktop/splat-1.3.0$




    Hi all. I'm a beginner in SPLAT linux. My SPLAT is not working properly.
    *** ERROR: No transmitter site(s) specified!
    How do i decide that problem?
    Pls help!!!

Tags for this Thread

Bookmarks

Posting Permissions

  • You may not post new threads
  • You may not post replies
  • You may not post attachments
  • You may not edit your posts
  •