PDA

View Full Version : How do you compile source code (sleepyhead src from Sourceforge)?



rocksockdoc
March 10th, 2012, 06:42 AM
I've never compiled before.
I tried the following to compile SleepyHead from SourceForge bulld instructions (http://sourceforge.net/apps/mediawiki/sleepyhead/index.php?title=Build_from_source) but failed miserably on Ubuntu 10.04.

Request: If you're on Ubuntu 10.04, can you just tell me (yay or nay) if this works for you to install sleepyhead?

0. Read about SleepyHead open-source freeware from the SleepyHead Web Site (http://sleepyhead.sourceforge.net/).

1. Install the GIT program so as to be able to 'git' the source code:
$ sudo apt-get install git-core

2. Download the source code using that newly installed GIT protocol:
$ git clone git://sleepyhead.git.sourceforge.net/gitroot/sleepyhead/sleepyhead

3. Install QT development tools, if needed:
$ sudo apt-get install qt4-dev-tools libqt4-opengl-dev

4. Run the make command (that's all it says in the README):
qmake
make

Does it work for you?
http://ubuntuforums.org/attachment.php?attachmentid=214050&stc=1&d=1331389855

It didn't work for me:
- Tutorial for installing SourceForge SleepyHead CPAP/BiPAP (Sleep Apnea) software (http://ubuntuforums.org/showthread.php?t=1937358)

PS: The *.deb is already known to fail on Ubuntu 10.04, which it predictably did.
http://ubuntuforums.org/attachment.php?attachmentid=214051&stc=1&d=1331389852

oldos2er
March 10th, 2012, 07:58 PM
Moved to Packaging and Compiling Programs.

MadCow108
March 11th, 2012, 02:09 AM
what error do you get?

it works fine in lucid setup, the only thing missing from the instructions is apt-get install zlib1g-dev for zlib.h

rocksockdoc
March 11th, 2012, 06:20 AM
it works fine in lucid setup, the only thing missing from the instructions is apt-get install zlib1g-dev for zlib.h

Thank you very much to taking the time to help me out!
(I realize you don't have to help me!)

I have never compiled before so I'm at a disadvantage when it comes to figuring out what I need.

I am most concerned that others (who need this type of medical software!) on Ubuntu Lucid 10.04 can more easily compile the program, so, would you please take a look at these commands below to say if that's what you ran to install on Lucid 10.04?

Below is my take on the developer's instructions (http://sourceforge.net/apps/mediawiki/sleepyhead/index.php?title=Main_Page) from a page called Building From Source Code (http://sourceforge.net/apps/mediawiki/sleepyhead/index.php?title=Build_from_source) for Ubuntu 10.04 which references this "Build From Source (http://sourceforge.net/apps/mediawiki/sleepyhead/index.php?title=Build_from_source)" web page (with your hint above added):


1. Install C++ development tools and the GIT client:
$ sudo apt-get install git-core qt4-dev-tools libqt4-opengl-dev libqtwebkit-dev zlib1g-dev

2. Obtain SleepyHead source code:
$ git clone git://sleepyhead.git.sourceforge.net/gitroot/sleepyhead/sleepyhead

3. Create a Makefile in the local directory:
$ qmake

4. Create the "SleepyHead" executable:
$ make

5. Run the SleepyHead software:
$ ./SleepyHead
How does that look for easy instructions for Ubuntu Lucid 10.04 users?


what error do you get?

You don't really want to know!
I get VERY MANY errors & warnings when I run 'make'.


$ make
Makefile:1856: warning: overriding commands for target `moc_daily.cpp'
Makefile:1820: warning: ignoring old commands for target `moc_daily.cpp'
Makefile:1859: warning: overriding commands for target `moc_overview.cpp'
Makefile:1823: warning: ignoring old commands for target `moc_overview.cpp'
Makefile:1862: warning: overriding commands for target `moc_mainwindow.cpp'
Makefile:1826: warning: ignoring old commands for target `moc_mainwindow.cpp'
Makefile:1865: warning: overriding commands for target `moc_oximetry.cpp'
Makefile:1817: warning: ignoring old commands for target `moc_oximetry.cpp'
Makefile:1868: warning: overriding commands for target `moc_preferencesdialog.cpp'
Makefile:1835: warning: ignoring old commands for target `moc_preferencesdialog.cpp'
Makefile:1874: warning: overriding commands for target `moc_profileselect.cpp'
Makefile:1841: warning: ignoring old commands for target `moc_profileselect.cpp'
Makefile:1877: warning: overriding commands for target `moc_newprofile.cpp'
Makefile:1844: warning: ignoring old commands for target `moc_newprofile.cpp'
Makefile:1880: warning: overriding commands for target `moc_exportcsv.cpp'
Makefile:1847: warning: ignoring old commands for target `moc_exportcsv.cpp'
Makefile:1883: warning: overriding commands for target `moc_UpdaterWindow.cpp'
Makefile:1853: warning: ignoring old commands for target `moc_UpdaterWindow.cpp'
g++ -c -pipe -g -Wall -W -O2 -D_REENTRANT -DGIT_BRANCH=\\\"master -D\\\" -DGIT_REVISION=\\\"c7b66c52671a1a487580392eaa5b1d56647bd48e -D\\\" -DQT_NO_DEBUG -DQT_THREAD_SUPPORT -DQT_SHARED -DQT_TABLET_SUPPORT -I/usr/share/qt3/mkspecs/default -I. -I/usr/include/qt3 -o main.o main.cpp
<command-line>: warning: missing terminating " character
<command-line>: error: macro names must be identifiers
<command-line>: warning: missing terminating " character
<command-line>: warning: missing terminating " character
<command-line>: error: macro names must be identifiers
<command-line>: warning: missing terminating " character
main.cpp:8:30: error: QtGui/QApplication: No such file or directory
main.cpp:9:23: error: QMessageBox: No such file or directory
main.cpp:10:25: error: QFontDatabase: No such file or directory
main.cpp:11:23: error: QStringList: No such file or directory
main.cpp:12:18: error: QDebug: No such file or directory
main.cpp:13:23: error: QPushButton: No such file or directory
main.cpp:14:21: error: QWebFrame: No such file or directory
main.cpp:15:20: error: QWebView: No such file or directory
In file included from main.cpp:17:
SleepLib/schema.h:10:18: error: QColor: No such file or directory
SleepLib/schema.h:11:17: error: QHash: No such file or directory
SleepLib/schema.h:12:20: error: QVariant: No such file or directory
SleepLib/schema.h:13:19: error: QString: No such file or directory
In file included from SleepLib/schema.h:14,
from main.cpp:17:
SleepLib/machine_common.h:12:19: error: QVector: No such file or directory
In file included from main.cpp:18:
mainwindow.h:10:23: error: QMainWindow: No such file or directory
mainwindow.h:11:22: error: QGLContext: No such file or directory
mainwindow.h:12:33: error: QNetworkAccessManager: No such file or directory
mainwindow.h:13:25: error: QNetworkReply: No such file or directory
mainwindow.h:14:27: error: QSystemTrayIcon: No such file or directory
In file included from mainwindow.h:17,
from main.cpp:18:
daily.h:11:17: error: QMenu: No such file or directory
daily.h:12:19: error: QAction: No such file or directory
daily.h:13:19: error: QWidget: No such file or directory
daily.h:14:23: error: QTreeWidget: No such file or directory
daily.h:15:23: error: QHBoxLayout: No such file or directory
daily.h:17:18: error: QLabel: No such file or directory
daily.h:18:31: error: QtOpenGL/QGLContext: No such file or directory
daily.h:19:22: error: QScrollBar: No such file or directory
daily.h:20:28: error: QTableWidgetItem: No such file or directory
In file included from Graphs/gSummaryChart.h:10,
from daily.h:21,
from mainwindow.h:17,
from main.cpp:18:
./SleepLib/profiles.h:14:30: error: QCryptographicHash: No such file or directory
./SleepLib/profiles.h:15:19: error: QThread: No such file or directory
In file included from ./SleepLib/profiles.h:16,
from Graphs/gSummaryChart.h:10,
from daily.h:21,
from mainwindow.h:17,
from main.cpp:18:
./SleepLib/machine.h:13:21: error: QDateTime: No such file or directory
./SleepLib/machine.h:15:18: error: QMutex: No such file or directory
./SleepLib/machine.h:16:22: error: QSemaphore: No such file or directory
In file included from ./SleepLib/machine.h:22,
from ./SleepLib/profiles.h:16,
from Graphs/gSummaryChart.h:10,
from daily.h:21,
from mainwindow.h:17,
from main.cpp:18:
./SleepLib/preferences.h:16:23: error: QDomElement: No such file or directory
./SleepLib/preferences.h:17:24: error: QDomDocument: No such file or directory
In file included from ./SleepLib/day.h:10,
from ./SleepLib/machine.h:28,
from ./SleepLib/profiles.h:16,
from Graphs/gSummaryChart.h:10,
from daily.h:21,
from mainwindow.h:17,
from main.cpp:18:
./SleepLib/common.h:5:19: error: QObject: No such file or directory
./SleepLib/common.h:7:35: error: missing binary operator before token "("
In file included from Graphs/gSummaryChart.h:11,
from daily.h:21,
from mainwindow.h:17,
from main.cpp:18:
Graphs/gGraphView.h:10:21: error: QGLWidget: No such file or directory
Graphs/gGraphView.h:12:24: error: QResizeEvent: No such file or directory
Graphs/gGraphView.h:17:26: error: QWaitCondition: No such file or directory
Graphs/gGraphView.h:18:19: error: QPixmap: No such file or directory
In file included from Graphs/gGraphView.h:19,
from Graphs/gSummaryChart.h:11,
from daily.h:21,
from mainwindow.h:17,
from main.cpp:18:
./Graphs/glcommon.h:10:26: error: QtOpenGL/qgl.h: No such file or directory
In file included from mainwindow.h:18,
from main.cpp:18:
overview.h:13:21: error: QDateEdit: No such file or directory
In file included from mainwindow.h:19,
from main.cpp:18:
oximetry.h:13:21: error: QSplitter: No such file or directory
In file included from ./qextserialport/qextserialport.h:5,
from oximetry.h:14,
from mainwindow.h:19,
from main.cpp:18:
./qextserialport/qextserialport_global.h:6:28: error: QtCore/qglobal.h: No such file or directory
In file included from oximetry.h:14,
from mainwindow.h:19,
from main.cpp:18:
./qextserialport/qextserialport.h:123:21: error: QIODevice: No such file or directory
./qextserialport/qextserialport.h:133:27: error: QSocketNotifier: No such file or directory
In file included from mainwindow.h:20,
from main.cpp:18:
preferencesdialog.h:10:19: error: QDialog: No such file or directory
preferencesdialog.h:11:23: error: QModelIndex: No such file or directory
preferencesdialog.h:12:27: error: QListWidgetItem: No such file or directory
preferencesdialog.h:13:28: error: QStringListModel: No such file or directory
preferencesdialog.h:14:33: error: QSortFilterProxyModel: No such file or directory
preferencesdialog.h:15:30: error: QStandardItemModel: No such file or directory
In file included from main.cpp:29:
SleepLib/loader_plugins/icon_loader.h:14:21: error: QMultiMap: No such file or directory
In file included from SleepLib/schema.h:14,
from main.cpp:17:
SleepLib/machine_common.h:19: error: ‘quint32’ does not name a type
SleepLib/machine_common.h:23: error: ‘qint16’ does not name a type
SleepLib/machine_common.h:31: error: ‘quint32’ does not name a type
SleepLib/machine_common.h:37: error: ‘qint64’ does not name a type
In file included from SleepLib/schema.h:14,
from main.cpp:17:
SleepLib/machine_common.h:86: error: ‘ChannelID’ does not name a type
SleepLib/machine_common.h:87: error: ‘ChannelID’ does not name a type
SleepLib/machine_common.h:96: error: ‘ChannelID’ does not name a type
SleepLib/machine_common.h:97: error: ‘ChannelID’ does not name a type
SleepLib/machine_common.h:98: error: ‘ChannelID’ does not name a type
SleepLib/machine_common.h:102: error: ‘ChannelID’ does not name a type
SleepLib/machine_common.h:104: error: ‘ChannelID’ does not name a type
SleepLib/machine_common.h:106: error: ‘ChannelID’ does not name a type
SleepLib/machine_common.h:108: error: ‘ChannelID’ does not name a type
In file included from main.cpp:17:
SleepLib/schema.h:17: error: ‘quint32’ does not name a type
SleepLib/schema.h:18: error: ‘quint32’ does not name a type
SleepLib/schema.h:19: error: ‘quint32’ does not name a type
SleepLib/schema.h:20: error: ‘quint32’ does not name a type
SleepLib/schema.h:21: error: ‘quint32’ does not name a type
SleepLib/schema.h:22: error: ‘quint32’ does not name a type
SleepLib/schema.h:51: error: ‘QString’ has not been declared
SleepLib/schema.h:51: error: ‘QString’ has not been declared
SleepLib/schema.h:51: error: ‘QString’ has not been declared
SleepLib/schema.h:51: error: ‘QString’ has not been declared
In file included from main.cpp:17:
SleepLib/schema.h:51: error: ‘QColor’ has not been declared
SleepLib/schema.h:52: error: ‘QColor’ has not been declared
SleepLib/schema.h:53: error: ‘QString’ has not been declared
SleepLib/schema.h:57: error: ISO C++ forbids declaration of ‘QString’ with no type
SleepLib/schema.h:57: error: expected ‘;’ before ‘&’ token
SleepLib/schema.h:58: error: expected ‘;’ before ‘const’
SleepLib/schema.h:58: error: ISO C++ forbids declaration of ‘QString’ with no type
SleepLib/schema.h:58: error: expected ‘;’ before ‘&’ token
SleepLib/schema.h:59: error: expected ‘;’ before ‘const’
SleepLib/schema.h:59: error: ISO C++ forbids declaration of ‘QString’ with no type
SleepLib/schema.h:59: error: expected ‘;’ before ‘&’ token
SleepLib/schema.h:60: error: expected ‘;’ before ‘const’
SleepLib/schema.h:60: error: ISO C++ forbids declaration of ‘QString’ with no type
SleepLib/schema.h:60: error: expected ‘;’ before ‘&’ token
SleepLib/schema.h:62: error: expected ‘;’ before ‘void’
SleepLib/schema.h:62: error: ‘QString’ has not been declared
SleepLib/schema.h:63: error: ‘QString’ has not been declared
SleepLib/schema.h:64: error: ‘QString’ has not been declared
SleepLib/schema.h:65: error: ‘QString’ does not name a type
SleepLib/schema.h:70: error: ISO C++ forbids declaration of ‘QColor’ with no type
SleepLib/schema.h:70: error: expected ‘;’ before ‘&’ token
SleepLib/schema.h:71: error: expected ‘;’ before ‘void’
SleepLib/schema.h:71: error: ‘QColor’ has not been declared
SleepLib/schema.h:72: error: ISO C++ forbids declaration of ‘QHash’ with no type
SleepLib/schema.h:72: error: expected ‘;’ before ‘<’ token
SleepLib/schema.h:73: error: ISO C++ forbids declaration of ‘QHash’ with no type
SleepLib/schema.h:73: error: expected ‘;’ before ‘<’ token
SleepLib/schema.h:74: error: ISO C++ forbids declaration of ‘QList’ with no type
SleepLib/schema.h:74: error: expected ‘;’ before ‘<’ token
SleepLib/schema.h:80: error: ‘QString’ does not name a type
SleepLib/schema.h:81: error: ‘QString’ does not name a type
SleepLib/schema.h:82: error: ‘QString’ does not name a type
SleepLib/schema.h:83: error: ‘QString’ does not name a type
SleepLib/schema.h:85: error: ‘QColor’ does not name a type
SleepLib/schema.h:51: error: ‘Qt’ has not been declared
SleepLib/schema.h: In member function ‘void schema::Channel::addColor(schema::Function, int)’:
SleepLib/schema.h:52: error: ‘m_colors’ was not declared in this scope
SleepLib/schema.h: In member function ‘void schema::Channel::addOption(int, int)’:
SleepLib/schema.h:53: error: ‘m_options’ was not declared in this scope
SleepLib/schema.h: In member function ‘void schema::Channel::setLabel(int)’:
SleepLib/schema.h:62: error: ‘m_label’ was not declared in this scope
SleepLib/schema.h: In member function ‘void schema::Channel::setUnit(int)’:
SleepLib/schema.h:63: error: ‘m_unit’ was not declared in this scope
SleepLib/schema.h: In member function ‘void schema::Channel::setDescription(int)’:
SleepLib/schema.h:64: error: ‘m_description’ was not declared in this scope
SleepLib/schema.h: In member function ‘void schema::Channel::setDefaultColor(int)’:
SleepLib/schema.h:71: error: ‘m_defaultcolor’ was not declared in this scope
SleepLib/schema.h: At global scope:
SleepLib/schema.h:100: error: ‘QString’ has not been declared
SleepLib/schema.h:103: error: ‘QString’ has not been declared
SleepLib/schema.h:106: error: declaration of ‘operator[]’ as non-function
SleepLib/schema.h:106: error: expected ‘;’ before ‘(’ token
SleepLib/schema.h:113: error: expected ‘;’ before ‘Channel’
SleepLib/schema.h:113: error: declaration of ‘operator[]’ as non-function
SleepLib/schema.h:113: error: expected ‘;’ before ‘(’ token
SleepLib/schema.h:121: error: expected ‘;’ before ‘QHash’
SleepLib/schema.h:121: error: ISO C++ forbids declaration of ‘QHash’ with no type
SleepLib/schema.h:121: error: expected ‘;’ before ‘<’ token
SleepLib/schema.h:124: error: ISO C++ forbids declaration of ‘QHash’ with no type
SleepLib/schema.h:124: error: expected ‘;’ before ‘<’ token
SleepLib/schema.h:127: error: ISO C++ forbids declaration of ‘QHash’ with no type
SleepLib/schema.h:127: error: expected ‘;’ before ‘<’ token
SleepLib/schema.h:128: error: ‘QString’ does not name a type
In file included from mainwindow.h:16,
from main.cpp:18:
version.h:11: error: ‘QString’ does not name a type
version.h:12: error: ‘QString’ does not name a type
version.h:14: error: ‘QString’ does not name a type
version.h:21: error: ‘QString’ does not name a type
In file included from ./SleepLib/machine.h:22,
from ./SleepLib/profiles.h:16,
from Graphs/gSummaryChart.h:10,
from daily.h:21,
from mainwindow.h:17,
from main.cpp:18:
./SleepLib/preferences.h:21: error: ‘QString’ does not name a type
./SleepLib/preferences.h:22: error: ‘QString’ does not name a type
./SleepLib/preferences.h:24: error: expected initializer before ‘&’ token
./SleepLib/preferences.h:26: error: ‘QString’ does not name a type
./SleepLib/preferences.h:32: error: expected initializer before ‘&’ token
./SleepLib/preferences.h:43: error: expected ‘)’ before ‘name’
./SleepLib/preferences.h:48: error: ‘QString’ does not name a type
In file included from ./SleepLib/machine.h:22,
from ./SleepLib/profiles.h:16,
from Graphs/gSummaryChart.h:10,
from daily.h:21,
from mainwindow.h:17,
from main.cpp:18:
./SleepLib/preferences.h:51: error: ISO C++ forbids declaration of ‘QVariant’ with no type
./SleepLib/preferences.h:51: error: expected ‘;’ before ‘&’ token
./SleepLib/preferences.h:56: error: expected ‘;’ before ‘void’
./SleepLib/preferences.h:56: error: ‘QString’ has not been declared
./SleepLib/preferences.h:56: error: ‘QVariant’ has not been declared
./SleepLib/preferences.h:61: error: ‘QString’ has not been declared
./SleepLib/preferences.h:66: error: ‘QString’ has not been declared
./SleepLib/preferences.h:73: error: ‘QString’ has not been declared
./SleepLib/preferences.h:80: error: ‘QDomElement’ has not been declared
./SleepLib/preferences.h:84: error: ‘QDomElement’ does not name a type
./SleepLib/preferences.h:89: error: ‘QString’ has not been declared
./SleepLib/preferences.h:94: error: ‘QString’ has not been declared
./SleepLib/preferences.h:97: error: ISO C++ forbids declaration of ‘QString’ with no type
./SleepLib/preferences.h:97: error: expected ‘,’ or ‘...’ before ‘&’ token
./SleepLib/preferences.h:103: error: ISO C++ forbids declaration of ‘QHash’ with no type
./SleepLib/preferences.h:103: error: ‘QHash’ declared as an ‘inline’ field
./SleepLib/preferences.h:103: error: expected ‘;’ before ‘<’ token
./SleepLib/preferences.h:106: error: expected ‘;’ before ‘inline’
./SleepLib/preferences.h:106: error: ISO C++ forbids declaration of ‘QHash’ with no type
./SleepLib/preferences.h:106: error: ‘QHash’ declared as an ‘inline’ field
./SleepLib/preferences.h:106: error: expected ‘;’ before ‘<’ token
./SleepLib/preferences.h:109: error: expected ‘;’ before ‘inline’
./SleepLib/preferences.h:109: error: ISO C++ forbids declaration of ‘QHash’ with no type
./SleepLib/preferences.h:109: error: ‘QHash’ declared as an ‘inline’ field
./SleepLib/preferences.h:109: error: expected ‘;’ before ‘<’ token
./SleepLib/preferences.h:114: error: expected ‘;’ before ‘QHash’
./SleepLib/preferences.h:114: error: ISO C++ forbids declaration of ‘QHash’ with no type
./SleepLib/preferences.h:114: error: expected ‘;’ before ‘<’ token
./SleepLib/preferences.h:118: error: ‘QString’ does not name a type
./SleepLib/preferences.h:119: error: ‘QString’ does not name a type
./SleepLib/preferences.h:120: error: ‘QString’ does not name a type
./SleepLib/preferences.h:121: error: ‘QString’ does not name a type
./SleepLib/preferences.h:89: error: default argument for parameter of type ‘int’ has type ‘const char [1]’
./SleepLib/preferences.h:94: error: default argument for parameter of type ‘int’ has type ‘const char [1]’
./SleepLib/preferences.h: In member function ‘void Preferences::Set(int, int)’:
./SleepLib/preferences.h:57: error: ‘p_preferences’ was not declared in this scope
./SleepLib/preferences.h: In member function ‘bool Preferences::contains(int)’:
./SleepLib/preferences.h:62: error: ‘p_preferences’ was not declared in this scope
./SleepLib/preferences.h: In member function ‘bool Preferences::ExistsAndTrue(int)’:
./SleepLib/preferences.h:67: error: ‘QHash’ was not declared in this scope
./SleepLib/preferences.h:67: error: ‘QString’ was not declared in this scope
./SleepLib/preferences.h:67: error: ‘QVariant’ was not declared in this scope
./SleepLib/preferences.h:67: error: missing template arguments before ‘i’
./SleepLib/preferences.h:67: error: expected ‘;’ before ‘i’
./SleepLib/preferences.h:68: error: ‘i’ was not declared in this scope
./SleepLib/preferences.h:68: error: ‘p_preferences’ was not declared in this scope
./SleepLib/preferences.h:69: error: ‘i’ was not declared in this scope
./SleepLib/preferences.h: At global scope:
./SleepLib/preferences.h:66: warning: unused parameter ‘name’
./SleepLib/preferences.h: In member function ‘void Preferences::Erase(int)’:
./SleepLib/preferences.h:74: error: ‘QHash’ was not declared in this scope
./SleepLib/preferences.h:74: error: ‘QString’ was not declared in this scope
./SleepLib/preferences.h:74: error: ‘QVariant’ was not declared in this scope
./SleepLib/preferences.h:74: error: missing template arguments before ‘i’
./SleepLib/preferences.h:74: error: expected ‘;’ before ‘i’
./SleepLib/preferences.h:75: error: ‘i’ was not declared in this scope
./SleepLib/preferences.h:75: error: ‘p_preferences’ was not declared in this scope
./SleepLib/preferences.h: At global scope:
./SleepLib/preferences.h:73: warning: unused parameter ‘name’
./SleepLib/preferences.h: In member function ‘void Preferences::SetComment(int)’:
./SleepLib/preferences.h:98: error: ‘p_comment’ was not declared in this scope
./SleepLib/preferences.h:98: error: ‘str’ was not declared in this scope
./SleepLib/preferences.h: At global scope:
./SleepLib/preferences.h:97: warning: unused parameter ‘QString’
In file included from ./SleepLib/machine.h:25,
from ./SleepLib/profiles.h:16,
from Graphs/gSummaryChart.h:10,
from daily.h:21,
from mainwindow.h:17,
from main.cpp:18:
./SleepLib/event.h:30: error: ‘qint64’ has not been declared
./SleepLib/event.h:30: error: ‘EventStoreType’ has not been declared
./SleepLib/event.h:31: error: ‘qint64’ has not been declared
./SleepLib/event.h:31: error: ‘EventStoreType’ has not been declared
./SleepLib/event.h:31: error: ‘EventStoreType’ has not been declared
./SleepLib/event.h:32: error: ‘qint64’ has not been declared
./SleepLib/event.h:32: error: ‘qint16’ has not been declared
./SleepLib/event.h:32: error: ‘qint64’ has not been declared
./SleepLib/event.h:33: error: ‘qint64’ has not been declared
./SleepLib/event.h:33: error: ‘qint64’ has not been declared
./SleepLib/event.h:34: error: ‘qint64’ has not been declared
./SleepLib/event.h:34: error: ‘qint64’ has not been declared
./SleepLib/event.h:37: error: ISO C++ forbids declaration of ‘quint32’ with no type
./SleepLib/event.h:37: error: ‘quint32’ declared as an ‘inline’ field
./SleepLib/event.h:37: error: expected ‘;’ before ‘&’ token
./SleepLib/event.h:40: error: expected ‘;’ before ‘void’
./SleepLib/event.h:40: error: ‘quint32’ has not been declared
./SleepLib/event.h:43: error: ‘EventStoreType’ does not name a type
./SleepLib/event.h:46: error: ‘EventStoreType’ does not name a type
./SleepLib/event.h:49: error: ‘quint32’ has not been declared
./SleepLib/event.h:52: error: ‘quint32’ has not been declared
./SleepLib/event.h:55: error: ‘qint64’ does not name a type
./SleepLib/event.h:61: error: ISO C++ forbids declaration of ‘qint64’ with no type
./SleepLib/event.h:61: error: ‘qint64’ declared as an ‘inline’ field
./SleepLib/event.h:61: error: expected ‘;’ before ‘&’ token
./SleepLib/event.h:64: error: expected ‘;’ before ‘inline’
./SleepLib/event.h:64: error: ISO C++ forbids declaration of ‘qint64’ with no type
./SleepLib/event.h:64: error: ‘qint64’ declared as an ‘inline’ field
./SleepLib/event.h:64: error: expected ‘;’ before ‘&’ token
./SleepLib/event.h:67: error: expected ‘;’ before ‘inline’
./SleepLib/event.h:67: error: ‘qint64’ does not name a type
./SleepLib/event.h:70: error: ‘qint64’ has not been declared
./SleepLib/event.h:72: error: ‘qint64’ has not been declared
./SleepLib/event.h:129: error: ‘QString’ does not name a type
./SleepLib/event.h:132: error: ‘QString’ has not been declared
./SleepLib/event.h:135: error: ISO C++ forbids declaration of ‘QVector’ with no type
./SleepLib/event.h:135: error: expected ‘;’ before ‘<’ token
./SleepLib/event.h:138: error: expected ‘;’ before ‘QVector’
./SleepLib/event.h:138: error: ISO C++ forbids declaration of ‘QVector’ with no type
./SleepLib/event.h:138: error: expected ‘;’ before ‘<’ token
./SleepLib/event.h:141: error: expected ‘;’ before ‘QVector’
./SleepLib/event.h:141: error: ISO C++ forbids declaration of ‘QVector’ with no type
./SleepLib/event.h:141: error: expected ‘;’ before ‘<’ token
./SleepLib/event.h:144: error: expected ‘;’ before ‘void’
./SleepLib/event.h:144: error: ‘quint32’ has not been declared
./SleepLib/event.h:145: error: ‘quint32’ has not been declared
./SleepLib/event.h:146: error: ‘quint32’ has not been declared
./SleepLib/event.h:147: error: ISO C++ forbids declaration of ‘EventStoreType’ with no type
./SleepLib/event.h:147: error: expected ‘;’ before ‘*’ token
./SleepLib/event.h:148: error: expected ‘;’ before ‘EventStoreType’
./SleepLib/event.h:148: error: ISO C++ forbids declaration of ‘EventStoreType’ with no type
./SleepLib/event.h:148: error: expected ‘;’ before ‘*’ token
./SleepLib/event.h:149: error: expected ‘;’ before ‘quint32’
./SleepLib/event.h:149: error: ISO C++ forbids declaration of ‘quint32’ with no type
./SleepLib/event.h:149: error: expected ‘;’ before ‘*’ token
./SleepLib/event.h:150: error: expected ‘;’ before ‘protected’
./SleepLib/event.h:153: error: ISO C++ forbids declaration of ‘QVector’ with no type
./SleepLib/event.h:153: error: expected ‘;’ before ‘<’ token
./SleepLib/event.h:156: error: ISO C++ forbids declaration of ‘QVector’ with no type
./SleepLib/event.h:156: error: expected ‘;’ before ‘<’ token
./SleepLib/event.h:159: error: ISO C++ forbids declaration of ‘QVector’ with no type
./SleepLib/event.h:159: error: expected ‘;’ before ‘<’ token
./SleepLib/event.h:166: error: ‘quint32’ does not name a type
./SleepLib/event.h:174: error: ‘QString’ does not name a type
./SleepLib/event.h:176: error: ‘qint64’ does not name a type
./SleepLib/event.h: In member function ‘void EventList::setCount(int)’:
./SleepLib/event.h:40: error: ‘m_count’ was not declared in this scope
./SleepLib/event.h: In member function ‘void EventList::setFirst(int)’:
./SleepLib/event.h:70: error: ‘m_first’ was not declared in this scope
./SleepLib/event.h: In member function ‘void EventList::setLast(int)’:
./SleepLib/event.h:72: error: ‘m_last’ was not declared in this scope
./SleepLib/event.h: In member function ‘void EventList::setDimension(int)’:
./SleepLib/event.h:132: error: ‘m_dimension’ was not declared in this scope
./SleepLib/event.h: In member function ‘void EventList::rawDataResize(int)’:
./SleepLib/event.h:144: error: ‘m_data’ was not declared in this scope
./SleepLib/event.h:144: error: ‘m_count’ was not declared in this scope
./SleepLib/event.h: In member function ‘void EventList::rawData2Resize(int)’:
./SleepLib/event.h:145: error: ‘m_data2’ was not declared in this scope
./SleepLib/event.h:145: error: ‘m_count’ was not declared in this scope
./SleepLib/event.h: In member function ‘void EventList::rawTimeResize(int)’:
./SleepLib/event.h:146: error: ‘m_time’ was not declared in this scope
./SleepLib/event.h:146: error: ‘m_count’ was not declared in this scope
In file included from ./SleepLib/machine.h:26,
from ./SleepLib/profiles.h:16,
from Graphs/gSummaryChart.h:10,
from daily.h:21,
from mainwindow.h:17,
from main.cpp:18:
./SleepLib/session.h: At global scope:
./SleepLib/session.h:37: error: ‘QString’ has not been declared
./SleepLib/session.h:40: error: ‘QString’ has not been declared
./SleepLib/session.h:43: error: ‘QString’ has not been declared
./SleepLib/session.h:48: error: ‘QString’ has not been declared
./SleepLib/session.h:51: error: ‘QString’ has not been declared
./SleepLib/session.h:60: error: ‘ChannelID’ has not been declared
./SleepLib/session.h:60: error: ‘qint64’ has not been declared
./SleepLib/session.h:60: error: ‘qint64’ has not been declared
./SleepLib/session.h:74: error: ‘qint64’ does not name a type
./SleepLib/session.h:77: error: ‘qint64’ does not name a type
./SleepLib/session.h:80: error: ‘qint64’ does not name a type
./SleepLib/session.h:90: error: ‘qint64’ has not been declared
./SleepLib/session.h:93: error: ‘qint64’ has not been declared
./SleepLib/session.h:96: error: ‘qint64’ has not been declared
./SleepLib/session.h:98: error: ‘qint64’ has not been declared
./SleepLib/session.h:102: error: ‘qint64’ has not been declared
./SleepLib/session.h:129: error: ISO C++ forbids declaration of ‘QHash’ with no type
./SleepLib/session.h:129: error: expected ‘;’ before ‘<’ token
./SleepLib/session.h:132: error: ISO C++ forbids declaration of ‘QHash’ with no type
./SleepLib/session.h:132: error: expected ‘;’ before ‘<’ token
./SleepLib/session.h:135: error: ISO C++ forbids declaration of ‘QHash’ with no type
./SleepLib/session.h:135: error: expected ‘;’ before ‘<’ token
./SleepLib/session.h:136: error: ISO C++ forbids declaration of ‘QHash’ with no type
./SleepLib/session.h:136: error: expected ‘;’ before ‘<’ token
./SleepLib/session.h:137: error: ISO C++ forbids declaration of ‘QHash’ with no type
./SleepLib/session.h:137: error: expected ‘;’ before ‘<’ token
./SleepLib/session.h:138: error: ISO C++ forbids declaration of ‘QHash’ with no type
./SleepLib/session.h:138: error: expected ‘;’ before ‘<’ token
./SleepLib/session.h:139: error: ISO C++ forbids declaration of ‘QHash’ with no type
./SleepLib/session.h:139: error: expected ‘;’ before ‘<’ token
./SleepLib/session.h:140: error: ISO C++ forbids declaration of ‘QHash’ with no type
./SleepLib/session.h:140: error: expected ‘;’ before ‘<’ token
./SleepLib/session.h:141: error: ISO C++ forbids declaration of ‘QHash’ with no type
./SleepLib/session.h:141: error: expected ‘;’ before ‘<’ token
./SleepLib/session.h:142: error: ISO C++ forbids declaration of ‘QHash’ with no type
./SleepLib/session.h:142: error: expected ‘;’ before ‘<’ token
./SleepLib/session.h:143: error: ISO C++ forbids declaration of ‘QHash’ with no type
./SleepLib/session.h:143: error: expected ‘;’ before ‘<’ token
./SleepLib/session.h:144: error: ISO C++ forbids declaration of ‘QHash’ with no type
./SleepLib/session.h:144: error: expected ‘;’ before ‘<’ token
./SleepLib/session.h:146: error: ISO C++ forbids declaration of ‘QHash’ with no type
./SleepLib/session.h:146: error: expected ‘;’ before ‘<’ token
./SleepLib/session.h:147: error: ISO C++ forbids declaration of ‘QHash’ with no type
./SleepLib/session.h:147: error: expected ‘;’ before ‘<’ token
./SleepLib/session.h:148: error: ISO C++ forbids declaration of ‘QHash’ with no type
./SleepLib/session.h:148: error: expected ‘;’ before ‘<’ token
./SleepLib/session.h:151: error: ‘ChannelID’ has not been declared
./SleepLib/session.h:154: error: ‘ChannelID’ has not been declared
./SleepLib/session.h:157: error: ‘ChannelID’ has not been declared
./SleepLib/session.h:158: error: ‘ChannelID’ has not been declared
./SleepLib/session.h:159: error: ‘ChannelID’ has not been declared
./SleepLib/session.h:160: error: ‘ChannelID’ has not been declared
./SleepLib/session.h:161: error: ‘ChannelID’ has not been declared
./SleepLib/session.h:162: error: ‘ChannelID’ has not been declared
./SleepLib/session.h:166: error: ‘ChannelID’ has not been declared
./SleepLib/session.h:167: error: ‘ChannelID’ has not been declared
./SleepLib/session.h:168: error: ‘ChannelID’ has not been declared
./SleepLib/session.h:168: error: ‘qint64’ has not been declared
./SleepLib/session.h:169: error: ‘ChannelID’ has not been declared
./SleepLib/session.h:169: error: ‘qint64’ has not been declared
./SleepLib/session.h:171: error: ‘ChannelID’ has not been declared
./SleepLib/session.h:174: error: ‘ChannelID’ has not been declared
./SleepLib/session.h:174: error: ‘qint64’ has not been declared
./SleepLib/session.h:174: error: ‘qint64’ has not been declared
./SleepLib/session.h:177: error: ‘ChannelID’ has not been declared
./SleepLib/session.h:177: error: ‘qint64’ has not been declared
./SleepLib/session.h:177: error: ‘qint64’ has not been declared
./SleepLib/session.h:180: error: ‘ChannelID’ has not been declared
./SleepLib/session.h:180: error: ‘qint64’ has not been declared
./SleepLib/session.h:180: error: ‘qint64’ has not been declared
./SleepLib/session.h:183: error: ‘ChannelID’ has not been declared
./SleepLib/session.h:183: error: ‘qint64’ has not been declared
./SleepLib/session.h:183: error: ‘qint64’ has not been declared
./SleepLib/session.h:187: error: ‘ChannelID’ has not been declared
./SleepLib/session.h:190: error: ‘ChannelID’ has not been declared
./SleepLib/session.h:193: error: ‘ChannelID’ has not been declared
./SleepLib/session.h:196: error: ‘ChannelID’ has not been declared
./SleepLib/session.h:199: error: ‘ChannelID’ has not been declared
./SleepLib/session.h:202: error: ‘ChannelID’ has not been declared
./SleepLib/session.h:205: error: ‘ChannelID’ has not been declared
./SleepLib/session.h:208: error: ‘ChannelID’ has not been declared
./SleepLib/session.h:211: error: ‘ChannelID’ has not been declared
./SleepLib/session.h:214: error: ‘ChannelID’ has not been declared
./SleepLib/session.h:217: error: ‘ChannelID’ has not been declared
./SleepLib/session.h:220: error: ‘ChannelID’ has not been declared
./SleepLib/session.h:223: error: ‘ChannelID’ has not been declared
./SleepLib/session.h:231: error: ‘QString’ has not been declared
./SleepLib/session.h:234: error: ‘qint64’ has not been declared
./SleepLib/session.h:237: error: ‘qint64’ has not been declared
./SleepLib/session.h:240: error: ‘qint64’ does not name a type
./SleepLib/session.h:243: error: ‘qint64’ does not name a type
./SleepLib/session.h:249: error: expected ‘;’ before ‘(’ token
In file included from ./SleepLib/machine.h:26,
from ./SleepLib/profiles.h:16,
from Graphs/gSummaryChart.h:10,
from daily.h:21,
from mainwindow.h:17,
from main.cpp:18:
./SleepLib/session.h:257: error: ‘qint64’ does not name a type
./SleepLib/session.h:258: error: ‘qint64’ does not name a type
./SleepLib/session.h:266: error: ‘QString’ does not name a type
In file included from ./SleepLib/machine.h:26,
from ./SleepLib/profiles.h:16,
from Graphs/gSummaryChart.h:10,
from daily.h:21,
from mainwindow.h:17,
from main.cpp:18:
./SleepLib/session.h: In member function ‘void Session::really_set_first(int)’:
./SleepLib/session.h:93: error: ‘s_first’ was not declared in this scope
./SleepLib/session.h: In member function ‘void Session::really_set_last(int)’:
./SleepLib/session.h:96: error: ‘s_last’ was not declared in this scope
./SleepLib/session.h: In member function ‘void Session::set_first(int)’:
./SleepLib/session.h:99: error: ‘s_first’ was not declared in this scope
./SleepLib/session.h: In member function ‘void Session::set_last(int)’:
./SleepLib/session.h:103: error: ‘s_first’ was not declared in this scope
/usr/include/qt3/qglobal.h:978: error: too few arguments to function ‘void qWarning(const char*, ...)’
./SleepLib/session.h:104: error: at this point in file
./SleepLib/session.h:107: error: ‘s_last’ was not declared in this scope
./SleepLib/session.h: In member function ‘double Session::hours()’:
./SleepLib/session.h:113: error: ‘s_last’ was not declared in this scope
./SleepLib/session.h:113: error: ‘s_first’ was not declared in this scope
./SleepLib/session.h: In member function ‘void Session::setCount(int, int)’:
./SleepLib/session.h:157: error: ‘m_cnt’ was not declared in this scope
./SleepLib/session.h: In member function ‘void Session::setSum(int, EventDataType)’:
./SleepLib/session.h:158: error: ‘m_sum’ was not declared in this scope
./SleepLib/session.h: In member function ‘void Session::setMin(int, EventDataType)’:
./SleepLib/session.h:159: error: ‘m_min’ was not declared in this scope
./SleepLib/session.h: In member function ‘void Session::setMax(int, EventDataType)’:
./SleepLib/session.h:160: error: ‘m_max’ was not declared in this scope
./SleepLib/session.h: In member function ‘void Session::setAvg(int, EventDataType)’:
./SleepLib/session.h:161: error: ‘m_avg’ was not declared in this scope
./SleepLib/session.h: In member function ‘void Session::setWavg(int, EventDataType)’:
./SleepLib/session.h:162: error: ‘m_wavg’ was not declared in this scope
./SleepLib/session.h: In member function ‘void Session::setCph(int, EventDataType)’:
./SleepLib/session.h:166: error: ‘m_cph’ was not declared in this scope
./SleepLib/session.h: In member function ‘void Session::setSph(int, EventDataType)’:
./SleepLib/session.h:167: error: ‘m_sph’ was not declared in this scope
./SleepLib/session.h: In member function ‘void Session::setFirst(int, int)’:
./SleepLib/session.h:168: error: ‘m_firstchan’ was not declared in this scope
./SleepLib/session.h: In member function ‘void Session::setLast(int, int)’:
./SleepLib/session.h:169: error: ‘m_lastchan’ was not declared in this scope
./SleepLib/session.h: In member function ‘void Session::SetEventFile(int&)’:
./SleepLib/session.h:231: error: ‘s_eventfile’ was not declared in this scope
./SleepLib/session.h: In member function ‘void Session::updateFirst(int)’:
./SleepLib/session.h:234: error: ‘s_first’ was not declared in this scope
./SleepLib/session.h: In member function ‘void Session::updateLast(int)’:
./SleepLib/session.h:237: error: ‘s_last’ was not declared in this scope
In file included from ./SleepLib/day.h:10,
from ./SleepLib/machine.h:28,
from ./SleepLib/profiles.h:16,
from Graphs/gSummaryChart.h:10,
from daily.h:21,
from mainwindow.h:17,
from main.cpp:18:
./SleepLib/common.h: At global scope:
./SleepLib/common.h:25: error: ‘qint64’ does not name a type
./SleepLib/common.h: In constructor ‘ValueCount::ValueCount()’:
./SleepLib/common.h:18: error: ‘count’ was not declared in this scope
./SleepLib/common.h: In copy constructor ‘ValueCount::ValueCount(const ValueCount&)’:
./SleepLib/common.h:21: error: ‘count’ was not declared in this scope
./SleepLib/common.h:21: error: ‘const struct ValueCount’ has no member named ‘count’
./SleepLib/common.h: At global scope:
./SleepLib/common.h:35: error: ‘QString’ does not name a type
./SleepLib/common.h:38: error: ISO C++ forbids declaration of ‘QString’ with no type
./SleepLib/common.h:38: error: expected ‘,’ or ‘...’ before ‘&’ token
./SleepLib/common.h:41: error: ‘QString’ does not name a type
./SleepLib/common.h:42: error: ‘QString’ does not name a type
./SleepLib/common.h:43: error: ‘QString’ does not name a type
./SleepLib/common.h:44: error: ‘QString’ does not name a type
./SleepLib/common.h:45: error: ‘QString’ does not name a type
./SleepLib/common.h:46: error: ‘QString’ does not name a type
./SleepLib/common.h:47: error: ‘QString’ does not name a type
./SleepLib/common.h:48: error: ‘QString’ does not name a type
./SleepLib/common.h:50: error: ‘QString’ does not name a type
./SleepLib/common.h:51: error: ‘QString’ does not name a type
./SleepLib/common.h:53: error: ‘QString’ does not name a type
./SleepLib/common.h:54: error: ‘QString’ does not name a type
./SleepLib/common.h:55: error: ‘QString’ does not name a type
./SleepLib/common.h:56: error: ‘QString’ does not name a type
./SleepLib/common.h:57: error: ‘QString’ does not name a type
./SleepLib/common.h:58: error: ‘QString’ does not name a type
./SleepLib/common.h:60: error: ‘QString’ does not name a type
./SleepLib/common.h:61: error: ‘QString’ does not name a type
./SleepLib/common.h:63: error: ‘QString’ does not name a type
./SleepLib/common.h:65: error: ‘QString’ does not name a type
./SleepLib/common.h:66: error: ‘QString’ does not name a type
./SleepLib/common.h:67: error: ‘QString’ does not name a type
./SleepLib/common.h:68: error: ‘QString’ does not name a type
./SleepLib/common.h:69: error: ‘QString’ does not name a type
./SleepLib/common.h:70: error: ‘QString’ does not name a type
./SleepLib/common.h:71: error: ‘QString’ does not name a type
./SleepLib/common.h:72: error: ‘QString’ does not name a type
./SleepLib/common.h:73: error: ‘QString’ does not name a type
./SleepLib/common.h:75: error: ‘QString’ does not name a type
./SleepLib/common.h:76: error: ‘QString’ does not name a type
./SleepLib/common.h:77: error: ‘QString’ does not name a type
./SleepLib/common.h:78: error: ‘QString’ does not name a type
./SleepLib/common.h:79: error: ‘QString’ does not name a type
./SleepLib/common.h:80: error: ‘QString’ does not name a type
./SleepLib/common.h:81: error: ‘QString’ does not name a type
./SleepLib/common.h:82: error: ‘QString’ does not name a type
./SleepLib/common.h:84: error: ‘QString’ does not name a type
./SleepLib/common.h:85: error: ‘QString’ does not name a type
./SleepLib/common.h:86: error: ‘QString’ does not name a type
./SleepLib/common.h:87: error: ‘QString’ does not name a type
./SleepLib/common.h:88: error: ‘QString’ does not name a type
./SleepLib/common.h:89: error: ‘QString’ does not name a type
./SleepLib/common.h:90: error: ‘QString’ does not name a type
./SleepLib/common.h:92: error: ‘QString’ does not name a type
./SleepLib/common.h:93: error: ‘QString’ does not name a type
./SleepLib/common.h:94: error: ‘QString’ does not name a type
./SleepLib/common.h:96: error: ‘QString’ does not name a type
In file included from ./SleepLib/machine.h:28,
from ./SleepLib/profiles.h:16,
from Graphs/gSummaryChart.h:10,
from daily.h:21,
from mainwindow.h:17,
from main.cpp:18:
./SleepLib/day.h:42: error: ‘ChannelID’ has not been declared
./SleepLib/day.h:45: error: ‘ChannelID’ has not been declared
./SleepLib/day.h:48: error: ‘ChannelID’ has not been declared
./SleepLib/day.h:51: error: ‘ChannelID’ has not been declared
./SleepLib/day.h:54: error: ‘ChannelID’ has not been declared
./SleepLib/day.h:57: error: ‘ChannelID’ has not been declared
./SleepLib/day.h:60: error: ‘ChannelID’ has not been declared
./SleepLib/day.h:63: error: ‘ChannelID’ has not been declared
./SleepLib/day.h:66: error: ‘ChannelID’ has not been declared
./SleepLib/day.h:69: error: ‘ChannelID’ has not been declared
./SleepLib/day.h:72: error: ‘ChannelID’ has not been declared
./SleepLib/day.h:75: error: ‘ChannelID’ has not been declared
./SleepLib/day.h:78: error: ‘ChannelID’ has not been declared
./SleepLib/day.h:81: error: ‘ChannelID’ has not been declared
./SleepLib/day.h:84: error: ‘ChannelID’ has not been declared
./SleepLib/day.h:87: error: ‘ChannelID’ has not been declared
./SleepLib/day.h:90: error: ‘qint64’ does not name a type
./SleepLib/day.h:93: error: ‘qint64’ does not name a type
./SleepLib/day.h:102: error: ‘qint64’ does not name a type
./SleepLib/day.h:105: error: ‘qint64’ does not name a type
./SleepLib/day.h:108: error: ‘qint64’ does not name a type
./SleepLib/day.h:120: error: ISO C++ forbids declaration of ‘QVector’ with no type
./SleepLib/day.h:120: error: expected ‘;’ before ‘<’ token
./SleepLib/day.h:122: error: expected ‘;’ before ‘QVector’
./SleepLib/day.h:122: error: ISO C++ forbids declaration of ‘QVector’ with no type
./SleepLib/day.h:122: error: expected ‘;’ before ‘<’ token
./SleepLib/day.h:125: error: expected ‘;’ before ‘int’
./SleepLib/day.h:141: error: ISO C++ forbids declaration of ‘QVector’ with no type
./SleepLib/day.h:141: error: expected ‘;’ before ‘<’ token
./SleepLib/day.h:144: error: expected ‘;’ before ‘bool’
./SleepLib/day.h:144: error: ‘ChannelID’ has not been declared
./SleepLib/day.h:150: error: ‘ChannelID’ has not been declared
./SleepLib/day.h:153: error: ‘ChannelID’ has not been declared
./SleepLib/day.h:157: error: ISO C++ forbids declaration of ‘QVector’ with no type
./SleepLib/day.h:157: error: expected ‘;’ before ‘<’ token
./SleepLib/day.h:158: error: ISO C++ forbids declaration of ‘QHash’ with no type
./SleepLib/day.h:158: error: expected ‘;’ before ‘<’ token
./SleepLib/day.h: In member function ‘EventDataType Day::hours()’:
./SleepLib/day.h:114: error: ‘total_time’ was not declared in this scope
./SleepLib/day.h: In member function ‘Session* Day::operator[](int)’:
./SleepLib/day.h:117: error: ‘sessions’ was not declared in this scope
./SleepLib/day.h: In member function ‘int Day::find(Session*)’:
./SleepLib/day.h:125: error: ‘sessions’ was not declared in this scope
./SleepLib/day.h: In member function ‘int Day::size()’:
./SleepLib/day.h:130: error: ‘sessions’ was not declared in this scope
In file included from ./SleepLib/profiles.h:16,
from Graphs/gSummaryChart.h:10,
from daily.h:21,
from mainwindow.h:17,
from main.cpp:18:
./SleepLib/machine.h: At global scope:
./SleepLib/machine.h:40: error: expected class-name before ‘{’ token
./SleepLib/machine.h:41: error: ISO C++ forbids declaration of ‘Q_OBJECT’ with no type
./SleepLib/machine.h:42: error: expected ‘;’ before ‘public’
./SleepLib/machine.h:46: error: expected ‘;’ before ‘static’
./SleepLib/machine.h:52: error: ‘QString’ does not name a type
./SleepLib/machine.h:55: error: expected primary-expression before ‘void’
./SleepLib/machine.h:55: error: ISO C++ forbids declaration of ‘signals’ with no type
./SleepLib/machine.h:55: error: expected ‘;’ before ‘void’
./SleepLib/machine.h: In static member function ‘static void SaveThread::msleep(long unsigned int)’:
./SleepLib/machine.h:46: error: ‘QThread’ has not been declared
./SleepLib/machine.h: At global scope:
./SleepLib/machine.h:86: error: ISO C++ forbids declaration of ‘QMap’ with no type
./SleepLib/machine.h:86: error: expected ‘;’ before ‘<’ token
./SleepLib/machine.h:89: error: ISO C++ forbids declaration of ‘QHash’ with no type
./SleepLib/machine.h:89: error: expected ‘;’ before ‘<’ token
./SleepLib/machine.h:92: error: ISO C++ forbids declaration of ‘QHash’ with no type
./SleepLib/machine.h:92: error: expected ‘;’ before ‘<’ token
./SleepLib/machine.h:98: error: ‘QDate’ does not name a type
./SleepLib/machine.h:101: error: ‘QDate’ does not name a type
./SleepLib/machine.h:104: error: ‘QString’ has not been declared
./SleepLib/machine.h:110: error: ISO C++ forbids declaration of ‘QString’ with no type
./SleepLib/machine.h:110: error: expected ‘;’ before ‘&’ token
./SleepLib/machine.h:113: error: expected ‘;’ before ‘const’
./SleepLib/machine.h:116: error: ‘QString’ does not name a type
./SleepLib/machine.h:126: error: ISO C++ forbids declaration of ‘QDate’ with no type
./SleepLib/machine.h:126: error: expected ‘;’ before ‘&’ token
./SleepLib/machine.h:129: error: expected ‘;’ before ‘const’
./SleepLib/machine.h:129: error: ISO C++ forbids declaration of ‘QDate’ with no type
./SleepLib/machine.h:129: error: expected ‘;’ before ‘&’ token
./SleepLib/machine.h:132: error: expected ‘;’ before ‘Session’
./SleepLib/machine.h:135: error: ISO C++ forbids declaration of ‘QList’ with no type
./SleepLib/machine.h:135: error: expected ‘;’ before ‘<’ token
./SleepLib/machine.h:139: error: ‘QMutex’ does not name a type
./SleepLib/machine.h:140: error: ISO C++ forbids declaration of ‘QSemaphore’ with no type
./SleepLib/machine.h:140: error: expected ‘;’ before ‘*’ token
./SleepLib/machine.h:143: error: ‘QDate’ does not name a type
./SleepLib/machine.h:146: error: ‘QString’ does not name a type
./SleepLib/machine.h:148: error: ‘QString’ does not name a type
./SleepLib/machine.h: In member function ‘void Machine::SetClass(int)’:
./SleepLib/machine.h:104: error: ‘m_class’ was not declared in this scope
In file included from ./SleepLib/profiles.h:17,
from Graphs/gSummaryChart.h:10,
from daily.h:21,
from mainwindow.h:17,
from main.cpp:18:
./SleepLib/machine_loader.h: At global scope:
./SleepLib/machine_loader.h:36: error: ‘QString’ has not been declared
./SleepLib/machine_loader.h:42: error: ISO C++ forbids declaration of ‘QString’ with no type
./SleepLib/machine_loader.h:42: error: ‘QString’ declared as a ‘virtual’ field
./SleepLib/machine_loader.h:42: error: expected ‘;’ before ‘&’ token
./SleepLib/machine_loader.h:44: error: ‘QString’ has not been declared
./SleepLib/machine_loader.h:44: error: ‘QString’ has not been declared
./SleepLib/machine_loader.h:69: error: ISO C++ forbids declaration of ‘QList’ with no type
./SleepLib/machine_loader.h:69: error: expected ‘;’ before ‘<’ token
./SleepLib/machine_loader.h:70: error: ‘QString’ does not name a type
./SleepLib/machine_loader.h:44: error: default argument for parameter of type ‘int’ has type ‘const char [1]’
./SleepLib/machine_loader.h:78: error: expected constructor, destructor, or type conversion before ‘<’ token
In file included from Graphs/gSummaryChart.h:10,
from daily.h:21,
from mainwindow.h:17,
from main.cpp:18:
./SleepLib/profiles.h:47: error: expected ‘)’ before ‘name’
./SleepLib/profiles.h:53: error: ‘QString’ has not been declared
./SleepLib/profiles.h:56: error: ‘QString’ has not been declared
./SleepLib/profiles.h:61: error: ISO C++ forbids declaration of ‘QHash’ with no type
./SleepLib/profiles.h:61: error: expected ‘;’ before ‘<’ token
./SleepLib/profiles.h:78: error: ‘QString’ has not been declared
./SleepLib/profiles.h:84: error: ‘QDate’ has not been declared
./SleepLib/profiles.h:87: error: expected ‘;’ before ‘(’ token
./SleepLib/profiles.h:90: error: expected ‘;’ before ‘(’ token
./SleepLib/profiles.h:94: error: ISO C++ forbids declaration of ‘QList’ with no type
./SleepLib/profiles.h:94: error: expected ‘;’ before ‘<’ token
./SleepLib/profiles.h:97: error: ‘QDate’ has not been declared
./SleepLib/profiles.h:103: error: ‘QString’ has not been declared
./SleepLib/profiles.h:105: error: ‘QDate’ has not been declared
./SleepLib/profiles.h:105: error: ‘QDate’ has not been declared
./SleepLib/profiles.h:106: error: ‘ChannelID’ has not been declared
./SleepLib/profiles.h:106: error: ‘QDate’ has not been declared
./SleepLib/profiles.h:106: error: ‘QDate’ has not been declared
./SleepLib/profiles.h:107: error: ‘ChannelID’ has not been declared
./SleepLib/profiles.h:107: error: ‘QDate’ has not been declared
./SleepLib/profiles.h:107: error: ‘QDate’ has not been declared
./SleepLib/profiles.h:108: error: ‘QDate’ has not been declared
./SleepLib/profiles.h:108: error: ‘QDate’ has not been declared
./SleepLib/profiles.h:109: error: ‘ChannelID’ has not been declared
./SleepLib/profiles.h:109: error: ‘QDate’ has not been declared
./SleepLib/profiles.h:109: error: ‘QDate’ has not been declared
./SleepLib/profiles.h:110: error: ‘ChannelID’ has not been declared
./SleepLib/profiles.h:110: error: ‘QDate’ has not been declared
./SleepLib/profiles.h:110: error: ‘QDate’ has not been declared
./SleepLib/profiles.h:111: error: ‘ChannelID’ has not been declared
./SleepLib/profiles.h:111: error: ‘QDate’ has not been declared
./SleepLib/profiles.h:111: error: ‘QDate’ has not been declared
./SleepLib/profiles.h:112: error: ‘ChannelID’ has not been declared
./SleepLib/profiles.h:112: error: ‘QDate’ has not been declared
./SleepLib/profiles.h:112: error: ‘QDate’ has not been declared
./SleepLib/profiles.h:113: error: ‘ChannelID’ has not been declared
./SleepLib/profiles.h:113: error: ‘QDate’ has not been declared
./SleepLib/profiles.h:113: error: ‘QDate’ has not been declared
./SleepLib/profiles.h:115: error: ‘ChannelID’ has not been declared
./SleepLib/profiles.h:117: error: ‘ChannelID’ has not been declared
./SleepLib/profiles.h:117: error: ‘QDate’ has not been declared
./SleepLib/profiles.h:117: error: ‘QDate’ has not been declared
./SleepLib/profiles.h:118: error: ‘ChannelID’ has not been declared
./SleepLib/profiles.h:118: error: ‘QDate’ has not been declared
./SleepLib/profiles.h:118: error: ‘QDate’ has not been declared
./SleepLib/profiles.h:120: error: ‘QDomElement’ has not been declared
./SleepLib/profiles.h:121: error: ‘QDomElement’ does not name a type
./SleepLib/profiles.h:123: error: ISO C++ forbids declaration of ‘QMap’ with no type
./SleepLib/profiles.h:123: error: expected ‘;’ before ‘<’ token
./SleepLib/profiles.h:124: error: ‘QDate’ does not name a type
./SleepLib/profiles.h:125: error: ‘QDate’ does not name a type
./SleepLib/profiles.h:127: error: ‘QDate’ does not name a type
./SleepLib/profiles.h:128: error: ‘QDate’ does not name a type
./SleepLib/profiles.h:130: error: ‘QString’ does not name a type
./SleepLib/profiles.h:142: error: ‘QDate’ does not name a type
./SleepLib/profiles.h:53: error: default argument for parameter of type ‘int’ has type ‘const char [1]’
./SleepLib/profiles.h:56: error: default argument for parameter of type ‘int’ has type ‘const char [1]’
./SleepLib/profiles.h:105: error: ‘QDate’ was not declared in this scope
./SleepLib/profiles.h:105: error: ‘QDate’ was not declared in this scope
./SleepLib/profiles.h:106: error: ‘QDate’ was not declared in this scope
./SleepLib/profiles.h:106: error: ‘QDate’ was not declared in this scope
./SleepLib/profiles.h:107: error: ‘QDate’ was not declared in this scope
./SleepLib/profiles.h:107: error: ‘QDate’ was not declared in this scope
./SleepLib/profiles.h:108: error: ‘QDate’ was not declared in this scope
./SleepLib/profiles.h:108: error: ‘QDate’ was not declared in this scope
./SleepLib/profiles.h:109: error: ‘QDate’ was not declared in this scope
./SleepLib/profiles.h:109: error: ‘QDate’ was not declared in this scope
./SleepLib/profiles.h:110: error: ‘QDate’ was not declared in this scope
./SleepLib/profiles.h:110: error: ‘QDate’ was not declared in this scope
./SleepLib/profiles.h:111: error: ‘QDate’ was not declared in this scope
./SleepLib/profiles.h:111: error: ‘QDate’ was not declared in this scope
./SleepLib/profiles.h:112: error: ‘QDate’ was not declared in this scope
./SleepLib/profiles.h:112: error: ‘QDate’ was not declared in this scope
./SleepLib/profiles.h:113: error: ‘QDate’ was not declared in this scope
./SleepLib/profiles.h:113: error: ‘QDate’ was not declared in this scope
./SleepLib/profiles.h:117: error: ‘QDate’ was not declared in this scope
./SleepLib/profiles.h:117: error: ‘QDate’ was not declared in this scope
./SleepLib/profiles.h:118: error: ‘QDate’ was not declared in this scope
./SleepLib/profiles.h:118: error: ‘QDate’ was not declared in this scope
./SleepLib/profiles.h: In member function ‘bool Profile::contains(int)’:
./SleepLib/profiles.h:103: error: ‘p_preferences’ was not declared in this scope
./SleepLib/profiles.h: At global scope:
./SleepLib/profiles.h:147: warning: ‘GetLoader’ initialized and declared ‘extern’
./SleepLib/profiles.h:147: error: ‘QString’ was not declared in this scope
./SleepLib/profiles.h:159: error: ‘QString’ does not name a type
./SleepLib/profiles.h:160: error: ‘QString’ does not name a type
./SleepLib/profiles.h:161: error: ‘QString’ does not name a type
./SleepLib/profiles.h:162: error: ‘QString’ does not name a type
./SleepLib/profiles.h:163: error: ‘QString’ does not name a type
./SleepLib/profiles.h:164: error: ‘QString’ does not name a type
./SleepLib/profiles.h:167: error: ‘QString’ does not name a type
./SleepLib/profiles.h:168: error: ‘QString’ does not name a type
./SleepLib/profiles.h:169: error: ‘QString’ does not name a type
./SleepLib/profiles.h:170: error: ‘QString’ does not name a type
./SleepLib/profiles.h:171: error: ‘QString’ does not name a type
./SleepLib/profiles.h:172: error: ‘QString’ does not name a type
./SleepLib/profiles.h:173: error: ‘QString’ does not name a type
./SleepLib/profiles.h:174: error: ‘QString’ does not name a type
./SleepLib/profiles.h:175: error: ‘QString’ does not name a type
./SleepLib/profiles.h:176: error: ‘QString’ does not name a type
./SleepLib/profiles.h:177: error: ‘QString’ does not name a type
./SleepLib/profiles.h:178: error: ‘QString’ does not name a type
./SleepLib/profiles.h:179: error: ‘QString’ does not name a type
./SleepLib/profiles.h:180: error: ‘QString’ does not name a type
./SleepLib/profiles.h:183: error: ‘QString’ does not name a type
./SleepLib/profiles.h:184: error: ‘QString’ does not name a type
./SleepLib/profiles.h:185: error: ‘QString’ does not name a type
./SleepLib/profiles.h:186: error: ‘QString’ does not name a type
./SleepLib/profiles.h:187: error: ‘QString’ does not name a type
./SleepLib/profiles.h:188: error: ‘QString’ does not name a type
./SleepLib/profiles.h:189: error: ‘QString’ does not name a type
./SleepLib/profiles.h:190: error: ‘QString’ does not name a type
./SleepLib/profiles.h:193: error: ‘QString’ does not name a type
./SleepLib/profiles.h:194: error: ‘QString’ does not name a type
./SleepLib/profiles.h:195: error: ‘QString’ does not name a type
./SleepLib/profiles.h:196: error: ‘QString’ does not name a type
./SleepLib/profiles.h:197: error: ‘QString’ does not name a type
./SleepLib/profiles.h:198: error: ‘QString’ does not name a type
./SleepLib/profiles.h:199: error: ‘QString’ does not name a type
./SleepLib/profiles.h:200: error: ‘QString’ does not name a type
./SleepLib/profiles.h:201: error: ‘QString’ does not name a type
./SleepLib/profiles.h:202: error: ‘QString’ does not name a type
./SleepLib/profiles.h:203: error: ‘QString’ does not name a type
./SleepLib/profiles.h:204: error: ‘QString’ does not name a type
./SleepLib/profiles.h:205: error: ‘QString’ does not name a type
./SleepLib/profiles.h:206: error: ‘QString’ does not name a type
./SleepLib/profiles.h:207: error: ‘QString’ does not name a type
./SleepLib/profiles.h:208: error: ‘QString’ does not name a type
./SleepLib/profiles.h:209: error: ‘QString’ does not name a type
./SleepLib/profiles.h:210: error: ‘QString’ does not name a type
./SleepLib/profiles.h:211: error: ‘QString’ does not name a type
./SleepLib/profiles.h:214: error: ‘QString’ does not name a type
./SleepLib/profiles.h:215: error: ‘QString’ does not name a type
./SleepLib/profiles.h:216: error: ‘QString’ does not name a type
./SleepLib/profiles.h:217: error: ‘QString’ does not name a type
./SleepLib/profiles.h:218: error: ‘QString’ does not name a type
./SleepLib/profiles.h:219: error: ‘QString’ does not name a type
./SleepLib/profiles.h:220: error: ‘QString’ does not name a type
./SleepLib/profiles.h:221: error: ‘QString’ does not name a type
./SleepLib/profiles.h:224: error: ‘QString’ does not name a type
./SleepLib/profiles.h:225: error: ‘QString’ does not name a type
./SleepLib/profiles.h:226: error: ‘QString’ does not name a type
./SleepLib/profiles.h:227: error: ‘QString’ does not name a type
./SleepLib/profiles.h:228: error: ‘QString’ does not name a type
./SleepLib/profiles.h:229: error: ‘QString’ does not name a type
./SleepLib/profiles.h:232: error: ‘QString’ does not name a type
./SleepLib/profiles.h:233: error: ‘QString’ does not name a type
./SleepLib/profiles.h:234: error: ‘QString’ does not name a type
./SleepLib/profiles.h:235: error: ‘QString’ does not name a type
./SleepLib/profiles.h:236: error: ‘QString’ does not name a type
./SleepLib/profiles.h:237: error: ‘QString’ does not name a type
./SleepLib/profiles.h:238: error: ‘QString’ does not name a type
./SleepLib/profiles.h:239: error: ‘QString’ does not name a type
./SleepLib/profiles.h:240: error: ‘QString’ does not name a type
./SleepLib/profiles.h:241: error: ‘QString’ does not name a type
./SleepLib/profiles.h:242: error: ‘QString’ does not name a type
./SleepLib/profiles.h:260: error: ‘QString’ does not name a type
./SleepLib/profiles.h:261: error: ‘QString’ does not name a type
./SleepLib/profiles.h:262: error: ‘QString’ does not name a type
./SleepLib/profiles.h:263: error: ‘QString’ does not name a type
./SleepLib/profiles.h:264: error: ‘QString’ does not name a type
./SleepLib/profiles.h:265: error: ‘QString’ does not name a type
./SleepLib/profiles.h:267: error: ‘QString’ has not been declared
./SleepLib/profiles.h:268: error: ‘QString’ has not been declared
./SleepLib/profiles.h:269: error: ‘QString’ has not been declared
./SleepLib/profiles.h:270: error: ‘QString’ has not been declared
./SleepLib/profiles.h:271: error: ‘QString’ has not been declared
./SleepLib/profiles.h:272: error: ‘QString’ has not been declared
./SleepLib/profiles.h: In constructor ‘DoctorInfo::DoctorInfo(Profile*)’:
./SleepLib/profiles.h:250: error: ‘STR_DI_Name’ was not declared in this scope
./SleepLib/profiles.h:250: error: ‘QString’ was not declared in this scope
./SleepLib/profiles.h:251: error: ‘STR_DI_Phone’ was not declared in this scope
./SleepLib/profiles.h:251: error: ‘QString’ was not declared in this scope
./SleepLib/profiles.h:252: error: ‘STR_DI_Email’ was not declared in this scope
./SleepLib/profiles.h:252: error: ‘QString’ was not declared in this scope
./SleepLib/profiles.h:253: error: ‘STR_DI_Practice’ was not declared in this scope
./SleepLib/profiles.h:253: error: ‘QString’ was not declared in this scope
./SleepLib/profiles.h:254: error: ‘STR_DI_Address’ was not declared in this scope
./SleepLib/profiles.h:254: error: ‘QString’ was not declared in this scope
./SleepLib/profiles.h:255: error: ‘STR_DI_PatientID’ was not declared in this scope
./SleepLib/profiles.h:255: error: ‘QString’ was not declared in this scope
./SleepLib/profiles.h: In member function ‘void DoctorInfo::setName(int)’:
./SleepLib/profiles.h:267: error: ‘STR_DI_Name’ was not declared in this scope
./SleepLib/profiles.h: In member function ‘void DoctorInfo::setPhone(int)’:
./SleepLib/profiles.h:268: error: ‘STR_DI_Phone’ was not declared in this scope
./SleepLib/profiles.h: In member function ‘void DoctorInfo::setEmail(int)’:
./SleepLib/profiles.h:269: error: ‘STR_DI_Email’ was not declared in this scope
./SleepLib/profiles.h: In member function ‘void DoctorInfo::setPracticeName(int)’:
./SleepLib/profiles.h:270: error: ‘STR_DI_Practice’ was not declared in this scope
./SleepLib/profiles.h: In member function ‘void DoctorInfo::setAddress(int)’:
./SleepLib/profiles.h:271: error: ‘STR_DI_Address’ was not declared in this scope
./SleepLib/profiles.h: In member function ‘void DoctorInfo::setPatientID(int)’:
./SleepLib/profiles.h:272: error: ‘STR_DI_PatientID’ was not declared in this scope
./SleepLib/profiles.h: At global scope:
./SleepLib/profiles.h:307: error: ‘QDate’ does not name a type
./SleepLib/profiles.h:308: error: ‘QString’ does not name a type
./SleepLib/profiles.h:309: error: ‘QString’ does not name a type
./SleepLib/profiles.h:310: error: ‘QString’ does not name a type
./SleepLib/profiles.h:311: error: ‘QString’ does not name a type
./SleepLib/profiles.h:312: error: ‘QString’ does not name a type
./SleepLib/profiles.h:313: error: ‘QString’ does not name a type
./SleepLib/profiles.h:315: error: ‘QString’ does not name a type
./SleepLib/profiles.h:317: error: ‘QString’ does not name a type
./SleepLib/profiles.h:318: error: ‘QString’ does not name a type
./SleepLib/profiles.h:321: error: ‘QDate’ has not been declared
./SleepLib/profiles.h:322: error: ‘QString’ has not been declared
./SleepLib/profiles.h:323: error: ‘QString’ has not been declared
./SleepLib/profiles.h:324: error: ‘QString’ has not been declared
./SleepLib/profiles.h:325: error: ‘QString’ has not been declared
./SleepLib/profiles.h:326: error: ‘QString’ has not been declared
./SleepLib/profiles.h:327: error: ‘QString’ has not been declared
./SleepLib/profiles.h:329: error: ‘QString’ has not been declared
./SleepLib/profiles.h:331: error: ‘QString’ has not been declared
./SleepLib/profiles.h:332: error: ‘QString’ has not been declared
./SleepLib/profiles.h:338: error: ‘QString’ has not been declared
./SleepLib/profiles.h:342: error: ‘QString’ has not been declared
./SleepLib/profiles.h: In constructor ‘UserInfo::UserInfo(Profile*)’:
./SleepLib/profiles.h:287: error: ‘STR_UI_DOB’ was not declared in this scope
./SleepLib/profiles.h:287: error: ‘QDate’ was not declared in this scope
./SleepLib/profiles.h:288: error: ‘STR_UI_FirstName’ was not declared in this scope
./SleepLib/profiles.h:288: error: ‘QString’ was not declared in this scope
./SleepLib/profiles.h:289: error: ‘STR_UI_LastName’ was not declared in this scope
./SleepLib/profiles.h:289: error: ‘QString’ was not declared in this scope
./SleepLib/profiles.h:290: error: ‘STR_UI_UserName’ was not declared in this scope
./SleepLib/profiles.h:290: error: ‘QString’ was not declared in this scope
./SleepLib/profiles.h:291: error: ‘STR_UI_Password’ was not declared in this scope
./SleepLib/profiles.h:291: error: ‘QString’ was not declared in this scope
./SleepLib/profiles.h:292: error: ‘STR_UI_Address’ was not declared in this scope
./SleepLib/profiles.h:292: error: ‘QString’ was not declared in this scope
./SleepLib/profiles.h:293: error: ‘STR_UI_Phone’ was not declared in this scope
./SleepLib/profiles.h:293: error: ‘QString’ was not declared in this scope
./SleepLib/profiles.h:294: error: ‘STR_UI_EmailAddress’ was not declared in this scope
./SleepLib/profiles.h:294: error: ‘QString’ was not declared in this scope
./SleepLib/profiles.h:295: error: ‘STR_UI_Country’ was not declared in this scope
./SleepLib/profiles.h:295: error: ‘QString’ was not declared in this scope
./SleepLib/profiles.h:296: error: ‘STR_UI_Height’ was not declared in this scope
./SleepLib/profiles.h:297: error: ‘STR_UI_Gender’ was not declared in this scope
./SleepLib/profiles.h:298: error: ‘STR_UI_TimeZone’ was not declared in this scope
./SleepLib/profiles.h:298: error: ‘QString’ was not declared in this scope
./SleepLib/profiles.h:299: error: ‘STR_UI_Language’ was not declared in this scope
./SleepLib/profiles.h:300: error: ‘STR_UI_DST’ was not declared in this scope
./SleepLib/profiles.h: In member function ‘double UserInfo::height()’:
./SleepLib/profiles.h:314: error: ‘STR_UI_Height’ was not declared in this scope
./SleepLib/profiles.h: In member function ‘Gender UserInfo::gender()’:
./SleepLib/profiles.h:316: error: ‘STR_UI_Gender’ was not declared in this scope
./SleepLib/profiles.h: In member function ‘bool UserInfo::daylightSaving()’:
./SleepLib/profiles.h:319: error: ‘STR_UI_DST’ was not declared in this scope
./SleepLib/profiles.h: In member function ‘void UserInfo::setDOB(int)’:
./SleepLib/profiles.h:321: error: ‘STR_UI_DOB’ was not declared in this scope
./SleepLib/profiles.h: In member function ‘void UserInfo::setFirstName(int)’:
./SleepLib/profiles.h:322: error: ‘STR_UI_FirstName’ was not declared in this scope
./SleepLib/profiles.h: In member function ‘void UserInfo::setLastName(int)’:
./SleepLib/profiles.h:323: error: ‘STR_UI_LastName’ was not declared in this scope
./SleepLib/profiles.h: In member function ‘void UserInfo::setUserName(int)’:
./SleepLib/profiles.h:324: error: ‘STR_UI_UserName’ was not declared in this scope
./SleepLib/profiles.h: In member function ‘void UserInfo::setAddress(int)’:
./SleepLib/profiles.h:325: error: ‘STR_UI_Address’ was not declared in this scope
./SleepLib/profiles.h: In member function ‘void UserInfo::setPhone(int)’:
./SleepLib/profiles.h:326: error: ‘STR_UI_Phone’ was not declared in this scope
./SleepLib/profiles.h: In member function ‘void UserInfo::setEmail(int)’:
./SleepLib/profiles.h:327: error: ‘STR_UI_EmailAddress’ was not declared in this scope
./SleepLib/profiles.h: In member function ‘void UserInfo::setHeight(double)’:
./SleepLib/profiles.h:328: error: ‘STR_UI_Height’ was not declared in this scope
./SleepLib/profiles.h: In member function ‘void UserInfo::setCountry(int)’:
./SleepLib/profiles.h:329: error: ‘STR_UI_Country’ was not declared in this scope
./SleepLib/profiles.h: In member function ‘void UserInfo::setGender(Gender)’:
./SleepLib/profiles.h:330: error: ‘STR_UI_Gender’ was not declared in this scope
./SleepLib/profiles.h: In member function ‘void UserInfo::setTimeZone(int)’:
./SleepLib/profiles.h:331: error: ‘STR_UI_TimeZone’ was not declared in this scope
./SleepLib/profiles.h: In member function ‘void UserInfo::setLanguage(int)’:
./SleepLib/profiles.h:332: error: ‘STR_UI_Language’ was not declared in this scope
./SleepLib/profiles.h: In member function ‘void UserInfo::setDaylightSaving(bool)’:
./SleepLib/profiles.h:333: error: ‘STR_UI_DST’ was not declared in this scope
./SleepLib/profiles.h: In member function ‘bool UserInfo::hasPassword()’:
./SleepLib/profiles.h:336: error: ‘STR_UI_Password’ was not declared in this scope
./SleepLib/profiles.h: In member function ‘bool UserInfo::checkPassword(int)’:
./SleepLib/profiles.h:339: error: ‘QByteArray’ was not declared in this scope
./SleepLib/profiles.h:339: error: expected ‘;’ before ‘ba’
./SleepLib/profiles.h:340: error: ‘STR_UI_Password’ was not declared in this scope
./SleepLib/profiles.h:340: error: ‘QCryptographicHash’ has not been declared
./SleepLib/profiles.h:340: error: ‘ba’ was not declared in this scope
./SleepLib/profiles.h:340: error: ‘QCryptographicHash’ has not been declared
./SleepLib/profiles.h:340: error: ‘QString’ was not declared in this scope
./SleepLib/profiles.h: At global scope:
./SleepLib/profiles.h:338: warning: unused parameter ‘password’
./SleepLib/profiles.h: In member function ‘void UserInfo::setPassword(int)’:
./SleepLib/profiles.h:343: error: ‘QByteArray’ was not declared in this scope
./SleepLib/profiles.h:343: error: expected ‘;’ before ‘ba’
./SleepLib/profiles.h:345: error: ‘STR_UI_Password’ was not declared in this scope
./SleepLib/profiles.h:345: error: ‘QCryptographicHash’ has not been declared
./SleepLib/profiles.h:345: error: ‘ba’ was not declared in this scope
./SleepLib/profiles.h:345: error: ‘QCryptographicHash’ has not been declared
./SleepLib/profiles.h:345: error: ‘QString’ was not declared in this scope
./SleepLib/profiles.h: At global scope:
./SleepLib/profiles.h:342: warning: unused parameter ‘password’
./SleepLib/profiles.h:376: error: ‘QString’ does not name a type
./SleepLib/profiles.h:385: error: ‘QString’ has not been declared
./SleepLib/profiles.h: In constructor ‘OxiSettings::OxiSettings(Profile*)’:
./SleepLib/profiles.h:361: error: ‘STR_OS_EnableOximetry’ was not declared in this scope
./SleepLib/profiles.h:362: error: ‘STR_OS_SyncOximetry’ was not declared in this scope
./SleepLib/profiles.h:363: error: ‘STR_OS_OximeterType’ was not declared in this scope
./SleepLib/profiles.h:364: error: ‘STR_OS_OxiDiscardThreshold’ was not declared in this scope
./SleepLib/profiles.h:365: error: ‘STR_OS_SPO2DropDuration’ was not declared in this scope
./SleepLib/profiles.h:366: error: ‘STR_OS_SPO2DropPercentage’ was not declared in this scope
./SleepLib/profiles.h:367: error: ‘STR_OS_PulseChangeDuration’ was not declared in this scope
./SleepLib/profiles.h:368: error: ‘STR_OS_PulseChangeBPM’ was not declared in this scope
./SleepLib/profiles.h: In member function ‘bool OxiSettings::oximetryEnabled()’:
./SleepLib/profiles.h:374: error: ‘STR_OS_EnableOximetry’ was not declared in this scope
./SleepLib/profiles.h: In member function ‘bool OxiSettings::syncOximetry()’:
./SleepLib/profiles.h:375: error: ‘STR_OS_SyncOximetry’ was not declared in this scope
./SleepLib/profiles.h: In member function ‘double OxiSettings::oxiDiscardThreshold()’:
./SleepLib/profiles.h:377: error: ‘STR_OS_OxiDiscardThreshold’ was not declared in this scope
./SleepLib/profiles.h: In member function ‘double OxiSettings::spO2DropDuration()’:
./SleepLib/profiles.h:378: error: ‘STR_OS_SPO2DropDuration’ was not declared in this scope
./SleepLib/profiles.h: In member function ‘double OxiSettings::spO2DropPercentage()’:
./SleepLib/profiles.h:379: error: ‘STR_OS_SPO2DropPercentage’ was not declared in this scope
./SleepLib/profiles.h: In member function ‘double OxiSettings::pulseChangeDuration()’:
./SleepLib/profiles.h:380: error: ‘STR_OS_PulseChangeDuration’ was not declared in this scope
./SleepLib/profiles.h: In member function ‘double OxiSettings::pulseChangeBPM()’:
./SleepLib/profiles.h:381: error: ‘STR_OS_PulseChangeBPM’ was not declared in this scope
./SleepLib/profiles.h: In member function ‘void OxiSettings::setOximetryEnabled(bool)’:
./SleepLib/profiles.h:383: error: ‘STR_OS_EnableOximetry’ was not declared in this scope
./SleepLib/profiles.h: In member function ‘void OxiSettings::setSyncOximetry(bool)’:
./SleepLib/profiles.h:384: error: ‘STR_OS_SyncOximetry’ was not declared in this scope
./SleepLib/profiles.h: In member function ‘void OxiSettings::setOximeterType(int)’:
./SleepLib/profiles.h:385: error: ‘STR_OS_OximeterType’ was not declared in this scope
./SleepLib/profiles.h: In member function ‘void OxiSettings::setOxiDiscardThreshold(double)’:
./SleepLib/profiles.h:386: error: ‘STR_OS_OxiDiscardThreshold’ was not declared in this scope
./SleepLib/profiles.h: In member function ‘void OxiSettings::setSpO2DropDuration(double)’:
./SleepLib/profiles.h:387: error: ‘STR_OS_SPO2DropDuration’ was not declared in this scope
./SleepLib/profiles.h: In member function ‘void OxiSettings::setSpO2DropPercentage(double)’:
./SleepLib/profiles.h:388: error: ‘STR_OS_SPO2DropPercentage’ was not declared in this scope
./SleepLib/profiles.h: In member function ‘void OxiSettings::setPulseChangeDuration(double)’:
./SleepLib/profiles.h:389: error: ‘STR_OS_PulseChangeDuration’ was not declared in this scope
./SleepLib/profiles.h: In member function ‘void OxiSettings::setPulseChangeBPM(double)’:
./SleepLib/profiles.h:390: error: ‘STR_OS_PulseChangeBPM’ was not declared in this scope
./SleepLib/profiles.h: At global scope:
./SleepLib/profiles.h:434: error: ‘QDate’ does not name a type
./SleepLib/profiles.h:435: error: ‘QString’ does not name a type
./SleepLib/profiles.h:441: error: ‘QString’ does not name a type
./SleepLib/profiles.h:442: error: ‘QDate’ does not name a type
./SleepLib/profiles.h:456: error: ‘QString’ has not been declared
./SleepLib/profiles.h:457: error: ‘QDate’ has not been declared
./SleepLib/profiles.h:461: error: ‘QDate’ has not been declared
./SleepLib/profiles.h:462: error: ‘QString’ has not been declared
./SleepLib/profiles.h: In constructor ‘CPAPSettings::CPAPSettings(Profile*)’:
./SleepLib/profiles.h:404: error: ‘STR_CS_ComplianceHours’ was not declared in this scope
./SleepLib/profiles.h:405: error: ‘STR_CS_ShowCompliance’ was not declared in this scope
./SleepLib/profiles.h:406: error: ‘STR_CS_ShowLeaksMode’ was not declared in this scope
./SleepLib/profiles.h:408: error: ‘STR_CS_MaskStartDate’ was not declared in this scope
./SleepLib/profiles.h:408: error: ‘QDate’ was not declared in this scope
./SleepLib/profiles.h:409: error: ‘STR_CS_MaskDescription’ was not declared in this scope
./SleepLib/profiles.h:409: error: ‘QString’ was not declared in this scope
./SleepLib/profiles.h:410: error: ‘STR_CS_MaskType’ was not declared in this scope
./SleepLib/profiles.h:411: error: ‘STR_CS_PrescribedMode’ was not declared in this scope
./SleepLib/profiles.h:412: error: ‘STR_CS_PrescribedMinPressure’ was not declared in this scope
./SleepLib/profiles.h:413: error: ‘STR_CS_PrescribedMaxPressure’ was not declared in this scope
./SleepLib/profiles.h:414: error: ‘STR_CS_UntreatedAHI’ was not declared in this scope
./SleepLib/profiles.h:415: error: ‘STR_CS_Notes’ was not declared in this scope
./SleepLib/profiles.h:415: error: ‘QString’ was not declared in this scope
./SleepLib/profiles.h:416: error: ‘STR_CS_DateDiagnosed’ was not declared in this scope
./SleepLib/profiles.h:416: error: ‘QDate’ was not declared in this scope
./SleepLib/profiles.h:417: error: ‘STR_CS_UserFlowRestriction’ was not declared in this scope
./SleepLib/profiles.h:418: error: ‘STR_CS_UserEventDuration’ was not declared in this scope
./SleepLib/profiles.h:419: error: ‘STR_CS_UserEventDuplicates’ was not declared in this scope
./SleepLib/profiles.h:420: error: ‘STR_CS_UserEventFlagging’ was not declared in this scope
./SleepLib/profiles.h:421: error: ‘STR_CS_AHIWindow’ was not declared in this scope
./SleepLib/profiles.h:422: error: ‘STR_CS_AHIReset’ was not declared in this scope
./SleepLib/profiles.h:423: error: ‘STR_CS_ClockDrift’ was not declared in this scope
./SleepLib/profiles.h: In member function ‘double CPAPSettings::complianceHours()’:
./SleepLib/profiles.h:431: error: ‘STR_CS_ComplianceHours’ was not declared in this scope
./SleepLib/profiles.h: In member function ‘bool CPAPSettings::showComplianceInfo()’:
./SleepLib/profiles.h:432: error: ‘STR_CS_ShowCompliance’ was not declared in this scope
./SleepLib/profiles.h: In member function ‘int CPAPSettings::leakMode()’:
./SleepLib/profiles.h:433: error: ‘STR_CS_ShowLeaksMode’ was not declared in this scope
./SleepLib/profiles.h: In member function ‘MaskType CPAPSettings::maskType()’:
./SleepLib/profiles.h:436: error: ‘STR_CS_MaskType’ was not declared in this scope
./SleepLib/profiles.h: In member function ‘CPAPMode CPAPSettings::mode()’:
./SleepLib/profiles.h:437: error: ‘STR_CS_PrescribedMode’ was not declared in this scope
./SleepLib/profiles.h: In member function ‘double CPAPSettings::minPressure()’:
./SleepLib/profiles.h:438: error: ‘STR_CS_PrescribedMinPressure’ was not declared in this scope
./SleepLib/profiles.h: In member function ‘double CPAPSettings::maxPressure()’:
./SleepLib/profiles.h:439: error: ‘STR_CS_PrescribedMaxPressure’ was not declared in this scope
./SleepLib/profiles.h: In member function ‘double CPAPSettings::untreatedAHI()’:
./SleepLib/profiles.h:440: error: ‘STR_CS_UntreatedAHI’ was not declared in this scope
./SleepLib/profiles.h: In member function ‘double CPAPSettings::userFlowRestriction()’:
./SleepLib/profiles.h:443: error: ‘STR_CS_UserFlowRestriction’ was not declared in this scope
./SleepLib/profiles.h: In member function ‘double CPAPSettings::userEventDuration()’:
./SleepLib/profiles.h:444: error: ‘STR_CS_UserEventDuration’ was not declared in this scope
./SleepLib/profiles.h: In member function ‘bool CPAPSettings::userEventDuplicates()’:
./SleepLib/profiles.h:445: error: ‘STR_CS_UserEventDuplicates’ was not declared in this scope
./SleepLib/profiles.h: In member function ‘double CPAPSettings::AHIWindow()’:
./SleepLib/profiles.h:446: error: ‘STR_CS_AHIWindow’ was not declared in this scope
./SleepLib/profiles.h: In member function ‘bool CPAPSettings::AHIReset()’:
./SleepLib/profiles.h:447: error: ‘STR_CS_AHIReset’ was not declared in this scope
./SleepLib/profiles.h: In member function ‘bool CPAPSettings::userEventFlagging()’:
./SleepLib/profiles.h:448: error: ‘STR_CS_UserEventFlagging’ was not declared in this scope
./SleepLib/profiles.h: In member function ‘int CPAPSettings::clockDrift()’:
./SleepLib/profiles.h:449: error: ‘STR_CS_ClockDrift’ was not declared in this scope
./SleepLib/profiles.h: In member function ‘void CPAPSettings::setMode(CPAPMode)’:
./SleepLib/profiles.h:452: error: ‘STR_CS_PrescribedMode’ was not declared in this scope
./SleepLib/profiles.h: In member function ‘void CPAPSettings::setMinPressure(double)’:
./SleepLib/profiles.h:453: error: ‘STR_CS_PrescribedMinPressure’ was not declared in this scope
./SleepLib/profiles.h: In member function ‘void CPAPSettings::setMaxPressure(double)’:
./SleepLib/profiles.h:454: error: ‘STR_CS_PrescribedMaxPressure’ was not declared in this scope
./SleepLib/profiles.h: In member function ‘void CPAPSettings::setUntreatedAHI(double)’:
./SleepLib/profiles.h:455: error: ‘STR_CS_UntreatedAHI’ was not declared in this scope
./SleepLib/profiles.h: In member function ‘void CPAPSettings::setNotes(int)’:
./SleepLib/profiles.h:456: error: ‘STR_CS_Notes’ was not declared in this scope
./SleepLib/profiles.h: In member function ‘void CPAPSettings::setDateDiagnosed(int)’:
./SleepLib/profiles.h:457: error: ‘STR_CS_DateDiagnosed’ was not declared in this scope
./SleepLib/profiles.h: In member function ‘void CPAPSettings::setComplianceHours(double)’:
./SleepLib/profiles.h:458: error: ‘STR_CS_ComplianceHours’ was not declared in this scope
./SleepLib/profiles.h: In member function ‘void CPAPSettings::setShowComplianceInfo(bool)’:
./SleepLib/profiles.h:459: error: ‘STR_CS_ShowCompliance’ was not declared in this scope
./SleepLib/profiles.h: In member function ‘void CPAPSettings::setLeakMode(int)’:
./SleepLib/profiles.h:460: error: ‘STR_CS_ShowLeaksMode’ was not declared in this scope
./SleepLib/profiles.h: In member function ‘void CPAPSettings::setMaskStartDate(int)’:
./SleepLib/profiles.h:461: error: ‘STR_CS_MaskStartDate’ was not declared in this scope
./SleepLib/profiles.h: In member function ‘void CPAPSettings::setMaskDescription(int)’:
./SleepLib/profiles.h:462: error: ‘STR_CS_MaskDescription’ was not declared in this scope
./SleepLib/profiles.h: In member function ‘void CPAPSettings::setMaskType(MaskType)’:
./SleepLib/profiles.h:463: error: ‘STR_CS_MaskType’ was not declared in this scope
./SleepLib/profiles.h: In member function ‘void CPAPSettings::setUserFlowRestriction(double)’:
./SleepLib/profiles.h:464: error: ‘STR_CS_UserFlowRestriction’ was not declared in this scope
./SleepLib/profiles.h: In member function ‘void CPAPSettings::setUserEventDuration(double)’:
./SleepLib/profiles.h:465: error: ‘STR_CS_UserEventDuration’ was not declared in this scope
./SleepLib/profiles.h: In member function ‘void CPAPSettings::setAHIWindow(double)’:
./SleepLib/profiles.h:466: error: ‘STR_CS_AHIWindow’ was not declared in this scope
./SleepLib/profiles.h: In member function ‘void CPAPSettings::setAHIReset(bool)’:
./SleepLib/profiles.h:467: error: ‘STR_CS_AHIReset’ was not declared in this scope
./SleepLib/profiles.h: In member function ‘void CPAPSettings::setUserEventFlagging(bool)’:
./SleepLib/profiles.h:468: error: ‘STR_CS_UserEventFlagging’ was not declared in this scope
./SleepLib/profiles.h: In member function ‘void CPAPSettings::setUserEventDuplicates(bool)’:
./SleepLib/profiles.h:469: error: ‘STR_CS_UserEventDuplicates’ was not declared in this scope
./SleepLib/profiles.h: In member function ‘void CPAPSettings::setClockDrift(int)’:
./SleepLib/profiles.h:470: error: ‘STR_CS_ClockDrift’ was not declared in this scope
./SleepLib/profiles.h: At global scope:
./SleepLib/profiles.h:497: error: ‘QTime’ does not name a type
./SleepLib/profiles.h:506: error: ‘QTime’ has not been declared
./SleepLib/profiles.h: In constructor ‘SessionSettings::SessionSettings(Profile*)’:
./SleepLib/profiles.h:484: error: ‘STR_IS_DaySplitTime’ was not declared in this scope
./SleepLib/profiles.h:484: error: ‘QTime’ was not declared in this scope
./SleepLib/profiles.h:485: error: ‘STR_IS_CacheSessions’ was not declared in this scope
./SleepLib/profiles.h:486: error: ‘STR_IS_CombineCloseSessions’ was not declared in this scope
./SleepLib/profiles.h:487: error: ‘STR_IS_IgnoreShorterSessions’ was not declared in this scope
./SleepLib/profiles.h:488: error: ‘STR_IS_Multithreading’ was not declared in this scope
./SleepLib/profiles.h:488: error: ‘QThread’ has not been declared
./SleepLib/profiles.h:489: error: ‘STR_IS_BackupCardData’ was not declared in this scope
./SleepLib/profiles.h:490: error: ‘STR_IS_CompressBackupData’ was not declared in this scope
./SleepLib/profiles.h:491: error: ‘STR_IS_CompressSessionData’ was not declared in this scope
./SleepLib/profiles.h: In member function ‘bool SessionSettings::cacheSessions()’:
./SleepLib/profiles.h:498: error: ‘STR_IS_CacheSessions’ was not declared in this scope
./SleepLib/profiles.h: In member function ‘double SessionSettings::combineCloseSessions()’:
./SleepLib/profiles.h:499: error: ‘STR_IS_CombineCloseSessions’ was not declared in this scope
./SleepLib/profiles.h: In member function ‘double SessionSettings::ignoreShortSessions()’:
./SleepLib/profiles.h:500: error: ‘STR_IS_IgnoreShorterSessions’ was not declared in this scope
./SleepLib/profiles.h: In member function ‘bool SessionSettings::multithreading()’:
./SleepLib/profiles.h:501: error: ‘STR_IS_Multithreading’ was not declared in this scope
./SleepLib/profiles.h: In member function ‘bool SessionSettings::compressSessionData()’:
./SleepLib/profiles.h:502: error: ‘STR_IS_CompressSessionData’ was not declared in this scope
./SleepLib/profiles.h: In member function ‘bool SessionSettings::compressBackupData()’:
./SleepLib/profiles.h:503: error: ‘STR_IS_CompressBackupData’ was not declared in this scope
./SleepLib/profiles.h: In member function ‘bool SessionSettings::backupCardData()’:
./SleepLib/profiles.h:504: error: ‘STR_IS_BackupCardData’ was not declared in this scope
./SleepLib/profiles.h: In member function ‘void SessionSettings::setDaySplitTime(int)’:
./SleepLib/profiles.h:506: error: ‘STR_IS_DaySplitTime’ was not declared in this scope
./SleepLib/profiles.h: In member function ‘void SessionSettings::setCacheSessions(bool)’:
./SleepLib/profiles.h:507: error: ‘STR_IS_CacheSessions’ was not declared in this scope
./SleepLib/profiles.h: In member function ‘void SessionSettings::setCombineCloseSessions(double)’:
./SleepLib/profiles.h:508: error: ‘STR_IS_CombineCloseSessions’ was not declared in this scope
./SleepLib/profiles.h: In member function ‘void SessionSettings::setIgnoreShortSessions(double)’:
./SleepLib/profiles.h:509: error: ‘STR_IS_IgnoreShorterSessions’ was not declared in this scope
./SleepLib/profiles.h: In member function ‘void SessionSettings::setMultithreading(bool)’:
./SleepLib/profiles.h:510: error: ‘STR_IS_Multithreading’ was not declared in this scope
./SleepLib/profiles.h: In member function ‘void SessionSettings::setBackupCardData(bool)’:
./SleepLib/profiles.h:511: error: ‘STR_IS_BackupCardData’ was not declared in this scope
./SleepLib/profiles.h: In member function ‘void SessionSettings::setCompressBackupData(bool)’:
./SleepLib/profiles.h:512: error: ‘STR_IS_CompressBackupData’ was not declared in this scope
./SleepLib/profiles.h: In member function ‘void SessionSettings::setCompressSessionData(bool)’:
./SleepLib/profiles.h:513: error: ‘STR_IS_CompressSessionData’ was not declared in this scope
./SleepLib/profiles.h: In constructor ‘AppearanceSettings::AppearanceSettings(Profile*)’ :
./SleepLib/profiles.h:527: error: ‘STR_AS_GraphHeight’ was not declared in this scope
./SleepLib/profiles.h:528: error: ‘STR_AS_AntiAliasing’ was not declared in this scope
./SleepLib/profiles.h:529: error: ‘STR_AS_GraphSnapshots’ was not declared in this scope
./SleepLib/profiles.h:530: error: ‘STR_AS_Animations’ was not declared in this scope
./SleepLib/profiles.h:531: error: ‘STR_AS_SquareWave’ was not declared in this scope
./SleepLib/profiles.h:532: error: ‘STR_AS_OverlayType’ was not declared in this scope
./SleepLib/profiles.h: In member function ‘int AppearanceSettings::graphHeight()’:
./SleepLib/profiles.h:539: error: ‘STR_AS_GraphHeight’ was not declared in this scope
./SleepLib/profiles.h: In member function ‘bool AppearanceSettings::antiAliasing()’:
./SleepLib/profiles.h:541: error: ‘STR_AS_AntiAliasing’ was not declared in this scope
./SleepLib/profiles.h: In member function ‘bool AppearanceSettings::graphSnapshots()’:
./SleepLib/profiles.h:543: error: ‘STR_AS_GraphSnapshots’ was not declared in this scope
./SleepLib/profiles.h: In member function ‘bool AppearanceSettings::animations()’:
./SleepLib/profiles.h:545: error: ‘STR_AS_Animations’ was not declared in this scope
./SleepLib/profiles.h: In member function ‘bool AppearanceSettings::squareWavePlots()’:
./SleepLib/profiles.h:547: error: ‘STR_AS_SquareWave’ was not declared in this scope
./SleepLib/profiles.h: In member function ‘OverlayDisplayType AppearanceSettings::overlayType()’:
./SleepLib/profiles.h:549: error: ‘STR_AS_OverlayType’ was not declared in this scope
./SleepLib/profiles.h: In member function ‘void AppearanceSettings::setGraphHeight(int)’:
./SleepLib/profiles.h:552: error: ‘STR_AS_GraphHeight’ was not declared in this scope
./SleepLib/profiles.h: In member function ‘void AppearanceSettings::setAntiAliasing(bool)’:
./SleepLib/profiles.h:554: error: ‘STR_AS_AntiAliasing’ was not declared in this scope
./SleepLib/profiles.h: In member function ‘void AppearanceSettings::setGraphSnapshots(bool)’:
./SleepLib/profiles.h:556: error: ‘STR_AS_GraphSnapshots’ was not declared in this scope
./SleepLib/profiles.h: In member function ‘void AppearanceSettings::setAnimations(bool)’:
./SleepLib/profiles.h:558: error: ‘STR_AS_Animations’ was not declared in this scope
./SleepLib/profiles.h: In member function ‘void AppearanceSettings::setSquareWavePlots(bool)’:
./SleepLib/profiles.h:560: error: ‘STR_AS_SquareWave’ was not declared in this scope
./SleepLib/profiles.h: In member function ‘void AppearanceSettings::setOverlayType(OverlayDisplayT ype)’:
./SleepLib/profiles.h:562: error: ‘STR_AS_OverlayType’ was not declared in this scope
./SleepLib/profiles.h: In constructor ‘UserSettings::UserSettings(Profile*)’:
./SleepLib/profiles.h:576: error: ‘STR_US_UnitSystem’ was not declared in this scope
./SleepLib/profiles.h:577: error: ‘STR_US_EventWindowSize’ was not declared in this scope
./SleepLib/profiles.h:578: error: ‘STR_US_SkipEmptyDays’ was not declared in this scope
./SleepLib/profiles.h:579: error: ‘STR_US_RebuildCache’ was not declared in this scope
./SleepLib/profiles.h:580: error: ‘STR_US_ShowDebug’ was not declared in this scope
./SleepLib/profiles.h:581: error: ‘STR_US_LinkGroups’ was not declared in this scope
./SleepLib/profiles.h:582: error: ‘STR_US_CalculateRDI’ was not declared in this scope
./SleepLib/profiles.h:583: error: ‘STR_US_ShowSerialNumbers’ was not declared in this scope
./SleepLib/profiles.h:584: error: ‘STR_US_PrefCalcMiddle’ was not declared in this scope
./SleepLib/profiles.h:585: error: ‘STR_US_PrefCalcPercentile’ was not declared in this scope
./SleepLib/profiles.h:586: error: ‘STR_US_PrefCalcMax’ was not declared in this scope
./SleepLib/profiles.h: In member function ‘UnitSystem UserSettings::unitSystem()’:
./SleepLib/profiles.h:592: error: ‘STR_US_UnitSystem’ was not declared in this scope
./SleepLib/profiles.h: In member function ‘double UserSettings::eventWindowSize()’:
./SleepLib/profiles.h:593: error: ‘STR_US_EventWindowSize’ was not declared in this scope
./SleepLib/profiles.h: In member function ‘bool UserSettings::skipEmptyDays()’:
./SleepLib/profiles.h:594: error: ‘STR_US_SkipEmptyDays’ was not declared in this scope
./SleepLib/profiles.h: In member function ‘bool UserSettings::rebuildCache()’:
./SleepLib/profiles.h:595: error: ‘STR_US_RebuildCache’ was not declared in this scope
./SleepLib/profiles.h: In member function ‘bool UserSettings::showDebug()’:
./SleepLib/profiles.h:596: error: ‘STR_US_ShowDebug’ was not declared in this scope
./SleepLib/profiles.h: In member function ‘bool UserSettings::linkGroups()’:
./SleepLib/profiles.h:597: error: ‘STR_US_LinkGroups’ was not declared in this scope
./SleepLib/profiles.h: In member function ‘bool UserSettings::calculateRDI()’:
./SleepLib/profiles.h:598: error: ‘STR_US_CalculateRDI’ was not declared in this scope
./SleepLib/profiles.h: In member function ‘bool UserSettings::showSerialNumbers()’:
./SleepLib/profiles.h:599: error: ‘STR_US_ShowSerialNumbers’ was not declared in this scope
./SleepLib/profiles.h: In member function ‘int UserSettings::prefCalcMiddle()’:
./SleepLib/profiles.h:600: error: ‘STR_US_PrefCalcMiddle’ was not declared in this scope
./SleepLib/profiles.h: In member function ‘double UserSettings::prefCalcPercentile()’:
./SleepLib/profiles.h:601: error: ‘STR_US_PrefCalcPercentile’ was not declared in this scope
./SleepLib/profiles.h: In member function ‘int UserSettings::prefCalcMax()’:
./SleepLib/profiles.h:602: error: ‘STR_US_PrefCalcMax’ was not declared in this scope
./SleepLib/profiles.h: In member function ‘void UserSettings::setUnitSystem(UnitSystem)’:
./SleepLib/profiles.h:605: error: ‘STR_US_UnitSystem’ was not declared in this scope
./SleepLib/profiles.h: In member function ‘void UserSettings::setEventWindowSize(double)’:
./SleepLib/profiles.h:606: error: ‘STR_US_EventWindowSize’ was not declared in this scope
./SleepLib/profiles.h: In member function ‘void UserSettings::setSkipEmptyDays(bool)’:
./SleepLib/profiles.h:607: error: ‘STR_US_SkipEmptyDays’ was not declared in this scope
./SleepLib/profiles.h: In member function ‘void UserSettings::setRebuildCache(bool)’:
./SleepLib/profiles.h:608: error: ‘STR_US_RebuildCache’ was not declared in this scope
./SleepLib/profiles.h: In member function ‘void UserSettings::setShowDebug(bool)’:
./SleepLib/profiles.h:609: error: ‘STR_US_ShowDebug’ was not declared in this scope
./SleepLib/profiles.h: In member function ‘void UserSettings::setLinkGroups(bool)’:
./SleepLib/profiles.h:610: error: ‘STR_US_LinkGroups’ was not declared in this scope
./SleepLib/profiles.h: In member function ‘void UserSettings::setCalculateRDI(bool)’:
./SleepLib/profiles.h:611: error: ‘STR_US_CalculateRDI’ was not declared in this scope
./SleepLib/profiles.h: In member function ‘void UserSettings::setShowSerialNumbers(bool)’:
./SleepLib/profiles.h:612: error: ‘STR_US_ShowSerialNumbers’ was not declared in this scope
./SleepLib/profiles.h: In member function ‘void UserSettings::setPrefCalcMiddle(int)’:
./SleepLib/profiles.h:613: error: ‘STR_US_PrefCalcMiddle’ was not declared in this scope
./SleepLib/profiles.h: In member function ‘void UserSettings::setPrefCalcPercentile(double)’:
./SleepLib/profiles.h:614: error: ‘STR_US_PrefCalcPercentile’ was not declared in this scope
./SleepLib/profiles.h: In member function ‘void UserSettings::setPrefCalcMax(int)’:
./SleepLib/profiles.h:615: error: ‘STR_US_PrefCalcMax’ was not declared in this scope
./SleepLib/profiles.h: At global scope:
./SleepLib/profiles.h:624: error: expected initializer before ‘<’ token
./SleepLib/profiles.h:628: error: ‘QString’ was not declared in this scope
./SleepLib/profiles.h:629: error: ‘QString’ was not declared in this scope
./SleepLib/profiles.h:630: error: ‘Profile* Profiles::Get()’ redeclared as different kind of symbol
./SleepLib/profiles.h:629: error: previous declaration of ‘Profile* Profiles::Get’
In file included from Graphs/gGraphView.h:19,
from Graphs/gSummaryChart.h:11,
from daily.h:21,
from mainwindow.h:17,
from main.cpp:18:
./Graphs/glcommon.h:18: error: ‘QColor’ has not been declared
./Graphs/glcommon.h:24: error: ISO C++ forbids declaration of ‘QColor’ with no type
./Graphs/glcommon.h:24: error: expected ‘,’ or ‘...’ before ‘color’
In file included from Graphs/gSummaryChart.h:11,
from daily.h:21,
from mainwindow.h:17,
from main.cpp:18:
Graphs/gGraphView.h:34: error: expected initializer before ‘*’ token
Graphs/gGraphView.h:35: error: expected initializer before ‘*’ token
Graphs/gGraphView.h:36: error: expected initializer before ‘*’ token
Graphs/gGraphView.h:38: error: expected initializer before ‘<’ token
Graphs/gGraphView.h:46: error: variable or field ‘GetTextExtent’ declared void
Graphs/gGraphView.h:46: error: ‘QString’ was not declared in this scope
Graphs/gGraphView.h:46: error: expected primary-expression before ‘int’
Graphs/gGraphView.h:46: error: expected primary-expression before ‘int’
Graphs/gGraphView.h:46: error: ‘QFont’ was not declared in this scope
Graphs/gGraphView.h:46: error: ‘font’ was not declared in this scope
Graphs/gGraphView.h:46: error: ‘defaultfont’ was not declared in this scope
Graphs/gGraphView.h:49: error: ‘QFont’ was not declared in this scope
Graphs/gGraphView.h:49: error: ‘font’ was not declared in this scope
Graphs/gGraphView.h:49: error: ‘defaultfont’ was not declared in this scope
Graphs/gGraphView.h:56: error: ‘quint32’ does not name a type
Graphs/gGraphView.h:72: error: expected ‘)’ before ‘_x’
Graphs/gGraphView.h:73: error: ‘GLshort’ does not name a type
Graphs/gGraphView.h:74: error: ‘GLshort’ does not name a type
Graphs/gGraphView.h:75: error: ‘RGBA’ does not name a type
Graphs/gGraphView.h:88: error: ‘GLshort’ has not been declared
Graphs/gGraphView.h:88: error: ‘GLshort’ has not been declared
Graphs/gGraphView.h:88: error: ‘RGBA’ has not been declared
Graphs/gGraphView.h:89: error: ‘GLshort’ has not been declared
Graphs/gGraphView.h:89: error: ‘GLshort’ has not been declared
Graphs/gGraphView.h:89: error: ‘GLshort’ has not been declared
Graphs/gGraphView.h:89: error: ‘GLshort’ has not been declared
Graphs/gGraphView.h:89: error: ‘RGBA’ has not been declared
Graphs/gGraphView.h:90: error: ‘GLshort’ has not been declared
Graphs/gGraphView.h:90: error: ‘GLshort’ has not been declared
Graphs/gGraphView.h:90: error: ‘GLshort’ has not been declared
Graphs/gGraphView.h:90: error: ‘GLshort’ has not been declared
Graphs/gGraphView.h:90: error: ‘GLshort’ has not been declared
Graphs/gGraphView.h:90: error: ‘GLshort’ has not been declared
Graphs/gGraphView.h:90: error: ‘GLshort’ has not been declared
Graphs/gGraphView.h:90: error: ‘GLshort’ has not been declared
Graphs/gGraphView.h:90: error: ‘RGBA’ has not been declared
Graphs/gGraphView.h:91: error: ‘GLshort’ has not been declared
Graphs/gGraphView.h:91: error: ‘GLshort’ has not been declared
Graphs/gGraphView.h:91: error: ‘GLshort’ has not been declared
Graphs/gGraphView.h:91: error: ‘GLshort’ has not been declared
Graphs/gGraphView.h:91: error: ‘GLshort’ has not been declared
Graphs/gGraphView.h:91: error: ‘GLshort’ has not been declared
Graphs/gGraphView.h:91: error: ‘GLshort’ has not been declared
Graphs/gGraphView.h:91: error: ‘GLshort’ has not been declared
Graphs/gGraphView.h:91: error: ‘RGBA’ has not been declared
Graphs/gGraphView.h:91: error: ‘RGBA’ has not been declared
In file included from Graphs/gSummaryChart.h:11,
from daily.h:21,
from mainwindow.h:17,
from main.cpp:18:
Graphs/gGraphView.h:93: error: ‘GLshort’ has not been declared
Graphs/gGraphView.h:93: error: ‘GLshort’ has not been declared
Graphs/gGraphView.h:94: error: ‘GLshort’ has not been declared
Graphs/gGraphView.h:94: error: ‘GLshort’ has not been declared
Graphs/gGraphView.h:94: error: ‘GLshort’ has not been declared
Graphs/gGraphView.h:94: error: ‘GLshort’ has not been declared
Graphs/gGraphView.h:95: error: ‘GLshort’ has not been declared
Graphs/gGraphView.h:95: error: ‘GLshort’ has not been declared
Graphs/gGraphView.h:95: error: ‘GLshort’ has not been declared
Graphs/gGraphView.h:95: error: ‘GLshort’ has not been declared
Graphs/gGraphView.h:95: error: ‘GLshort’ has not been declared
Graphs/gGraphView.h:95: error: ‘GLshort’ has not been declared
Graphs/gGraphView.h:95: error: ‘GLshort’ has not been declared
Graphs/gGraphView.h:95: error: ‘GLshort’ has not been declared
Graphs/gGraphView.h:97: error: ‘GLshort’ has not been declared
Graphs/gGraphView.h:97: error: ‘GLshort’ has not been declared
Graphs/gGraphView.h:98: error: ‘GLshort’ has not been declared
Graphs/gGraphView.h:98: error: ‘GLshort’ has not been declared
Graphs/gGraphView.h:98: error: ‘GLshort’ has not been declared
Graphs/gGraphView.h:98: error: ‘GLshort’ has not been declared
Graphs/gGraphView.h:99: error: ‘GLshort’ has not been declared
Graphs/gGraphView.h:99: error: ‘GLshort’ has not been declared
Graphs/gGraphView.h:99: error: ‘GLshort’ has not been declared
Graphs/gGraphView.h:99: error: ‘GLshort’ has not been declared
Graphs/gGraphView.h:99: error: ‘GLshort’ has not been declared
Graphs/gGraphView.h:99: error: ‘GLshort’ has not been declared
Graphs/gGraphView.h:99: error: ‘GLshort’ has not been declared
Graphs/gGraphView.h:99: error: ‘GLshort’ has not been declared
Graphs/gGraphView.h:103: error: ‘GLshort’ has not been declared
Graphs/gGraphView.h:103: error: ‘GLshort’ has not been declared
Graphs/gGraphView.h:103: error: ‘GLshort’ has not been declared
Graphs/gGraphView.h:103: error: ‘GLshort’ has not been declared
Graphs/gGraphView.h:108: error: ‘GLuint’ does not name a type
Graphs/gGraphView.h:115: error: ‘GLshort’ has not been declared
Graphs/gGraphView.h:117: error: ‘QColor’ has not been declared
Graphs/gGraphView.h:118: error: ‘GLuint’ has not been declared
Graphs/gGraphView.h:118: error: ‘GLuint’ has not been declared
Graphs/gGraphView.h:124: error: ‘GLuint’ does not name a type
Graphs/gGraphView.h:138: error: ‘GLshort’ does not name a type
Graphs/gGraphView.h:140: error: ‘GLuint’ does not name a type
Graphs/gGraphView.h:142: error: ‘GLshort’ does not name a type
Graphs/gGraphView.h:144: error: ‘GLuint’ does not name a type
Graphs/gGraphView.h:146: error: ‘GLuint’ does not name a type
In file included from Graphs/gSummaryChart.h:11,
from daily.h:21,
from mainwindow.h:17,
from main.cpp:18:
Graphs/gGraphView.h:85: error: ‘GL_LINES’ was not declared in this scope
In file included from Graphs/gSummaryChart.h:11,
from daily.h:21,
from mainwindow.h:17,
from main.cpp:18:
Graphs/gGraphView.h: In member function ‘void gVertexBuffer::scissor(int, int, int, int)’:
Graphs/gGraphView.h:103: error: ‘s_x’ was not declared in this scope
Graphs/gGraphView.h:103: error: ‘s_y’ was not declared in this scope
Graphs/gGraphView.h:103: error: ‘s_width’ was not declared in this scope
Graphs/gGraphView.h:103: error: ‘s_height’ was not declared in this scope
Graphs/gGraphView.h: In member function ‘void gVertexBuffer::setStipple(int)’:
Graphs/gGraphView.h:115: error: ‘m_stipple’ was not declared in this scope
Graphs/gGraphView.h: In member function ‘void gVertexBuffer::setBlendFunc(int, int)’:
Graphs/gGraphView.h:118: error: ‘m_blendfunc1’ was not declared in this scope
Graphs/gGraphView.h:118: error: ‘m_blendfunc2’ was not declared in this scope
Graphs/gGraphView.h: At global scope:
Graphs/gGraphView.h:157: error: ‘GLshort’ has not been declared
Graphs/gGraphView.h:157: error: ‘GLshort’ has not been declared
Graphs/gGraphView.h:157: error: ‘GLshort’ has not been declared
Graphs/gGraphView.h:157: error: ‘GLshort’ has not been declared
Graphs/gGraphView.h:168: error: ‘QColor’ has not been declared
Graphs/gGraphView.h:169: error: ‘GLuint’ has not been declared
Graphs/gGraphView.h:169: error: ‘GLuint’ has not been declared
Graphs/gGraphView.h:175: error: ‘QColor’ does not name a type
Graphs/gGraphView.h:181: error: ‘QMutex’ does not name a type
Graphs/gGraphView.h:183: error: ‘GLuint’ does not name a type
Graphs/gGraphView.h:155: error: ‘GL_LINES’ was not declared in this scope
Graphs/gGraphView.h: In member function ‘void GLBuffer::setColor(int)’:
Graphs/gGraphView.h:168: error: ‘m_color’ was not declared in this scope
Graphs/gGraphView.h: In member function ‘void GLBuffer::setBlendFunc(int, int)’:
Graphs/gGraphView.h:169: error: ‘m_blendfunc1’ was not declared in this scope
Graphs/gGraphView.h:169: error: ‘m_blendfunc2’ was not declared in this scope
Graphs/gGraphView.h: At global scope:
Graphs/gGraphView.h:223: error: ‘GLfloat’ has not been declared
Graphs/gGraphView.h:223: error: ‘GLfloat’ has not been declared
Graphs/gGraphView.h:223: error: ‘QColor’ has not been declared
Graphs/gGraphView.h:224: error: ‘GLfloat’ has not been declared
Graphs/gGraphView.h:224: error: ‘GLfloat’ has not been declared
Graphs/gGraphView.h:224: error: ‘GLfloat’ has not been declared
Graphs/gGraphView.h:224: error: ‘GLfloat’ has not been declared
Graphs/gGraphView.h:224: error: ‘QColor’ has not been declared
Graphs/gGraphView.h:225: error: ‘GLfloat’ has not been declared
Graphs/gGraphView.h:225: error: ‘GLfloat’ has not been declared
Graphs/gGraphView.h:225: error: ‘GLfloat’ has not been declared
Graphs/gGraphView.h:225: error: ‘GLfloat’ has not been declared
Graphs/gGraphView.h:225: error: ‘GLfloat’ has not been declared
Graphs/gGraphView.h:225: error: ‘GLfloat’ has not been declared
Graphs/gGraphView.h:225: error: ‘GLfloat’ has not been declared
Graphs/gGraphView.h:225: error: ‘GLfloat’ has not been declared
Graphs/gGraphView.h:225: error: ‘QColor’ has not been declared
Graphs/gGraphView.h:226: error: ‘GLfloat’ has not been declared
Graphs/gGraphView.h:226: error: ‘GLfloat’ has not been declared
Graphs/gGraphView.h:226: error: ‘GLfloat’ has not been declared
Graphs/gGraphView.h:226: error: ‘GLfloat’ has not been declared
Graphs/gGraphView.h:226: error: ‘GLfloat’ has not been declared
Graphs/gGraphView.h:226: error: ‘GLfloat’ has not been declared
Graphs/gGraphView.h:226: error: ‘GLfloat’ has not been declared
Graphs/gGraphView.h:226: error: ‘GLfloat’ has not been declared
Graphs/gGraphView.h:226: error: ‘QColor’ has not been declared
Graphs/gGraphView.h:226: error: ‘QColor’ has not been declared
Graphs/gGraphView.h:227: error: ‘GLfloat’ has not been declared
Graphs/gGraphView.h:227: error: ‘GLfloat’ has not been declared
Graphs/gGraphView.h:227: error: ‘GLfloat’ has not been declared
Graphs/gGraphView.h:227: error: ‘GLfloat’ has not been declared
Graphs/gGraphView.h:227: error: ‘GLfloat’ has not been declared
Graphs/gGraphView.h:227: error: ‘GLfloat’ has not been declared
Graphs/gGraphView.h:227: error: ‘GLfloat’ has not been declared
Graphs/gGraphView.h:227: error: ‘GLfloat’ has not been declared
Graphs/gGraphView.h:227: error: ‘QColor’ has not been declared
Graphs/gGraphView.h:227: error: ‘QColor’ has not been declared
Graphs/gGraphView.h:231: error: ISO C++ forbids declaration of ‘GLfloat’ with no type
Graphs/gGraphView.h:231: error: expected ‘;’ before ‘*’ token
Graphs/gGraphView.h:232: error: ISO C++ forbids declaration of ‘GLubyte’ with no type
Graphs/gGraphView.h:232: error: expected ‘;’ before ‘*’ token
Graphs/gGraphView.h:220: error: ‘GL_LINES’ was not declared in this scope
Graphs/gGraphView.h:247: error: ‘QString’ does not name a type
Graphs/gGraphView.h:249: error: ‘QColor’ does not name a type
Graphs/gGraphView.h:251: error: ISO C++ forbids declaration of ‘QFont’ with no type
Graphs/gGraphView.h:251: error: expected ‘;’ before ‘*’ token
Graphs/gGraphView.h:258: error: expected class-name before ‘{’ token
Graphs/gGraphView.h:260: error: expected ‘)’ before ‘*’ token
Graphs/gGraphView.h:261: error: ‘QWheelEvent’ has not been declared
Graphs/gGraphView.h:273: error: expected ‘)’ before ‘code’
Graphs/gGraphView.h:280: error: ‘ChannelID’ has not been declared
Graphs/gGraphView.h:282: error: ISO C++ forbids declaration of ‘ChannelID’ with no type
Graphs/gGraphView.h:282: error: expected ‘;’ before ‘&’ token
Graphs/gGraphView.h:285: error: expected ‘;’ before ‘virtual’
Graphs/gGraphView.h:294: error: ‘qint64’ does not name a type
Graphs/gGraphView.h:297: error: ‘qint64’ does not name a type
Graphs/gGraphView.h:309: error: ‘qint64’ has not been declared
Graphs/gGraphView.h:312: error: ‘qint64’ has not been declared
Graphs/gGraphView.h:372: error: ‘qint64’ does not name a type
Graphs/gGraphView.h:374: error: ‘ChannelID’ does not name a type
Graphs/gGraphView.h:383: error: ISO C++ forbids declaration of ‘QVector’ with no type
Graphs/gGraphView.h:383: error: expected ‘;’ before ‘<’ token
Graphs/gGraphView.h:384: error: ISO C++ forbids declaration of ‘QVector’ with no type
Graphs/gGraphView.h:384: error: expected ‘;’ before ‘<’ token
Graphs/gGraphView.h:387: error: ‘QWheelEvent’ has not been declared
Graphs/gGraphView.h:389: error: ‘QMouseEvent’ has not been declared
Graphs/gGraphView.h:391: error: ‘QMouseEvent’ has not been declared
Graphs/gGraphView.h:393: error: ‘QMouseEvent’ has not been declared
Graphs/gGraphView.h:395: error: ‘QMouseEvent’ has not been declared
Graphs/gGraphView.h:397: error: ‘QKeyEvent’ has not been declared
Graphs/gGraphView.h: In member function ‘virtual void Layer::SetCode(int)’:
Graphs/gGraphView.h:280: error: ‘m_code’ was not declared in this scope
Graphs/gGraphView.h: In member function ‘virtual void Layer::setMinX(int)’:
Graphs/gGraphView.h:309: error: ‘m_minx’ was not declared in this scope
Graphs/gGraphView.h: In member function ‘virtual void Layer::setMaxX(int)’:
Graphs/gGraphView.h:312: error: ‘m_maxx’ was not declared in this scope
Graphs/gGraphView.h: In member function ‘void Layer::addGLBuf(GLBuffer*)’:
Graphs/gGraphView.h:366: error: ‘mgl_buffers’ was not declared in this scope
Graphs/gGraphView.h: In member function ‘void Layer::addVertexBuffer(gVertexBuffer*)’:
Graphs/gGraphView.h:367: error: ‘mv_buffers’ was not declared in this scope
Graphs/gGraphView.h: At global scope:
Graphs/gGraphView.h:413: error: ‘qint64’ does not name a type
Graphs/gGraphView.h:416: error: ‘qint64’ does not name a type
Graphs/gGraphView.h:434: error: ISO C++ forbids declaration of ‘QVector’ with no type
Graphs/gGraphView.h:434: error: expected ‘;’ before ‘<’ token
Graphs/gGraphView.h:436: error: expected ‘;’ before ‘protected’
Graphs/gGraphView.h:438: error: ISO C++ forbids declaration of ‘QVector’ with no type
Graphs/gGraphView.h:438: error: expected ‘;’ before ‘<’ token
Graphs/gGraphView.h:449: error: expected class-name before ‘{’ token
Graphs/gGraphView.h:459: error: ‘QMutex’ does not name a type
Graphs/gGraphView.h:469: error: expected class-name before ‘{’ token
Graphs/gGraphView.h:470: error: ISO C++ forbids declaration of ‘Q_OBJECT’ with no type
Graphs/gGraphView.h:471: error: expected ‘;’ before ‘public’
Graphs/gGraphView.h:479: error: ‘QString’ has not been declared
Graphs/gGraphView.h:491: error: ISO C++ forbids declaration of ‘QTimer’ with no type
Graphs/gGraphView.h:491: error: expected ‘;’ before ‘*’ token
Graphs/gGraphView.h:492: error: ‘QPoint’ does not name a type
Graphs/gGraphView.h:494: error: ‘QString’ does not name a type
Graphs/gGraphView.h:497: error: expected ‘:’ before ‘slots’
Graphs/gGraphView.h:500: error: expected primary-expression before ‘void’
Graphs/gGraphView.h:500: error: ISO C++ forbids declaration of ‘slots’ with no type
Graphs/gGraphView.h:500: error: expected ‘;’ before ‘void’
Graphs/gGraphView.h:507: error: expected class-name before ‘{’ token
Graphs/gGraphView.h:508: error: ISO C++ forbids declaration of ‘Q_OBJECT’ with no type
Graphs/gGraphView.h:509: error: expected ‘;’ before ‘public’
Graphs/gGraphView.h:518: error: ‘QString’ has not been declared
Graphs/gGraphView.h:518: error: ‘QString’ has not been declared
Graphs/gGraphView.h:539: error: ‘QPixmap’ does not name a type
Graphs/gGraphView.h:578: error: ‘QColor’ has not been declared
Graphs/gGraphView.h:581: error: ‘QString’ has not been declared
Graphs/gGraphView.h:581: error: ‘QColor’ has not been declared
Graphs/gGraphView.h:581: error: ‘QFont’ has not been declared
Graphs/gGraphView.h:590: error: ‘QString’ does not name a type
Graphs/gGraphView.h:593: error: ISO C++ forbids declaration of ‘QString’ with no type
Graphs/gGraphView.h:593: error: expected ‘,’ or ‘...’ before ‘title’
Graphs/gGraphView.h:596: error: ‘QString’ does not name a type
Graphs/gGraphView.h:599: error: ISO C++ forbids declaration of ‘QString’ with no type
Graphs/gGraphView.h:599: error: expected ‘,’ or ‘...’ before ‘units’
Graphs/gGraphView.h:607: error: ‘qint64’ has not been declared
Graphs/gGraphView.h:607: error: ‘qint64’ has not been declared
Graphs/gGraphView.h:610: error: ‘qint64’ does not name a type
Graphs/gGraphView.h:613: error: ‘qint64’ does not name a type
Graphs/gGraphView.h:622: error: ‘qint64’ has not been declared
Graphs/gGraphView.h:625: error: ‘qint64’ has not been declared
Graphs/gGraphView.h:655: error: ‘qint64’ does not name a type
Graphs/gGraphView.h:689: error: ‘QString’ has not been declared
Graphs/gGraphView.h:729: error: ‘QRect’ does not name a type
Graphs/gGraphView.h:730: error: ISO C++ forbids declaration of ‘QTimer’ with no type
Graphs/gGraphView.h:730: error: expected ‘;’ before ‘*’ token
Graphs/gGraphView.h:733: error: ISO C++ forbids declaration of ‘QVector’ with no type
Graphs/gGraphView.h:733: error: expected ‘;’ before ‘<’ token
Graphs/gGraphView.h:735: error: expected ‘;’ before ‘short’
Graphs/gGraphView.h:740: error: ‘QWheelEvent’ has not been declared
Graphs/gGraphView.h:743: error: ‘QMouseEvent’ has not been declared
Graphs/gGraphView.h:746: error: ‘QMouseEvent’ has not been declared
Graphs/gGraphView.h:749: error: ‘QMouseEvent’ has not been declared
Graphs/gGraphView.h:752: error: ‘QMouseEvent’ has not been declared
Graphs/gGraphView.h:755: error: ‘QKeyEvent’ has not been declared
Graphs/gGraphView.h:762: error: ‘QString’ does not name a type
Graphs/gGraphView.h:763: error: ‘QString’ does not name a type
Graphs/gGraphView.h:766: error: ISO C++ forbids declaration of ‘QVector’ with no type
Graphs/gGraphView.h:766: error: expected ‘;’ before ‘<’ token
Graphs/gGraphView.h:773: error: ‘QRect’ does not name a type
Graphs/gGraphView.h:775: error: ‘QPoint’ does not name a type
Graphs/gGraphView.h:785: error: expected primary-expression before ‘protected’
Graphs/gGraphView.h:785: error: ISO C++ forbids declaration of ‘signals’ with no type
Graphs/gGraphView.h:785: error: expected ‘;’ before ‘protected’
Graphs/gGraphView.h:518: error: default argument for parameter of type ‘int’ has type ‘const char [1]’
Graphs/gGraphView.h:518: error: default argument for parameter of type ‘int’ has type ‘const char [1]’
Graphs/gGraphView.h:581: error: ‘Qt’ has not been declared
Graphs/gGraphView.h:581: error: ‘defaultfont’ was not declared in this scope
Graphs/gGraphView.h: In member function ‘void gGraph::setTitle(int)’:
Graphs/gGraphView.h:593: error: ‘m_title’ was not declared in this scope
Graphs/gGraphView.h:593: error: ‘title’ was not declared in this scope
Graphs/gGraphView.h: At global scope:
Graphs/gGraphView.h:593: warning: unused parameter ‘QString’
Graphs/gGraphView.h: In member function ‘void gGraph::setUnits(int)’:
Graphs/gGraphView.h:599: error: ‘m_units’ was not declared in this scope
Graphs/gGraphView.h:599: error: ‘units’ was not declared in this scope
Graphs/gGraphView.h: At global scope:
Graphs/gGraphView.h:599: warning: unused parameter ‘QString’
Graphs/gGraphView.h:802: error: expected class-name before ‘{’ token
Graphs/gGraphView.h:803: error: ISO C++ forbids declaration of ‘Q_OBJECT’ with no type
Graphs/gGraphView.h:804: error: expected ‘;’ before ‘public’
Graphs/gGraphView.h:836: error: ‘qint64’ has not been declared
Graphs/gGraphView.h:836: error: ‘qint64’ has not been declared
Graphs/gGraphView.h:839: error: ‘qint64’ has not been declared
Graphs/gGraphView.h:839: error: ‘qint64’ has not been declared
Graphs/gGraphView.h:845: error: ‘qint64’ has not been declared
Graphs/gGraphView.h:845: error: ‘qint64’ has not been declared
Graphs/gGraphView.h:848: error: ‘QString’ has not been declared
Graphs/gGraphView.h:851: error: ‘QString’ has not been declared
Graphs/gGraphView.h:854: error: expected ‘;’ before ‘(’ token
Graphs/gGraphView.h:867: error: ‘QPoint’ does not name a type
Graphs/gGraphView.h:868: error: ‘QPoint’ does not name a type
Graphs/gGraphView.h:869: error: ‘QPoint’ has not been declared
Graphs/gGraphView.h:870: error: ‘QPoint’ has not been declared
Graphs/gGraphView.h:886: error: ISO C++ forbids declaration of ‘QTimer’ with no type
Graphs/gGraphView.h:886: error: expected ‘;’ before ‘*’ token
Graphs/gGraphView.h:892: error: ‘QString’ has not been declared
Graphs/gGraphView.h:892: error: ‘QColor’ has not been declared
Graphs/gGraphView.h:892: error: ‘QFont’ has not been declared
Graphs/gGraphView.h:924: error: ‘QString’ has not been declared
Graphs/gGraphView.h:926: error: ‘QImage’ has not been declared
Graphs/gGraphView.h:929: error: ISO C++ forbids declaration of ‘QVector’ with no type
Graphs/gGraphView.h:929: error: expected ‘;’ before ‘<’ token
Graphs/gGraphView.h:930: error: ‘GLuint’ does not name a type
Graphs/gGraphView.h:980: error: ‘QResizeEvent’ has not been declared
Graphs/gGraphView.h:989: error: ‘QMouseEvent’ has not been declared
Graphs/gGraphView.h:991: error: ‘QMouseEvent’ has not been declared
Graphs/gGraphView.h:993: error: ‘QMouseEvent’ has not been declared
Graphs/gGraphView.h:995: error: ‘QMouseEvent’ has not been declared
Graphs/gGraphView.h:997: error: ‘QWheelEvent’ has not been declared
Graphs/gGraphView.h:999: error: ‘QKeyEvent’ has not been declared
Graphs/gGraphView.h:1005: error: ISO C++ forbids declaration of ‘QList’ with no type
Graphs/gGraphView.h:1005: error: expected ‘;’ before ‘<’ token
Graphs/gGraphView.h:1011: error: ISO C++ forbids declaration of ‘QVector’ with no type
Graphs/gGraphView.h:1011: error: expected ‘;’ before ‘<’ token
Graphs/gGraphView.h:1014: error: ISO C++ forbids declaration of ‘QHash’ with no type
Graphs/gGraphView.h:1014: error: expected ‘;’ before ‘<’ token
Graphs/gGraphView.h:1029: error: ‘QPoint’ does not name a type
Graphs/gGraphView.h:1030: error: ‘QPoint’ does not name a type
Graphs/gGraphView.h:1031: error: ‘QPoint’ does not name a type
Graphs/gGraphView.h:1035: error: ISO C++ forbids declaration of ‘QTimer’ with no type
Graphs/gGraphView.h:1035: error: expected ‘;’ before ‘*’ token
Graphs/gGraphView.h:1046: error: ‘QString’ does not name a type
Graphs/gGraphView.h:1049: error: ‘qint64’ does not name a type
Graphs/gGraphView.h:1052: error: ‘QPixmap’ does not name a type
Graphs/gGraphView.h:1053: error: ‘QPixmap’ does not name a type
Graphs/gGraphView.h:1061: error: ‘QPoint’ does not name a type
Graphs/gGraphView.h:1063: error: ‘QTime’ does not name a type
Graphs/gGraphView.h:1069: error: expected primary-expression before ‘public’
Graphs/gGraphView.h:1069: error: ISO C++ forbids declaration of ‘signals’ with no type
Graphs/gGraphView.h:1069: error: expected ‘;’ before ‘public’
Graphs/gGraphView.h:892: error: ‘Qt’ has not been declared
Graphs/gGraphView.h:892: error: ‘defaultfont’ was not declared in this scope
Graphs/gGraphView.h: In member function ‘void gGraphView::setPointClicked(int)’:
Graphs/gGraphView.h:869: error: ‘m_point_clicked’ was not declared in this scope
Graphs/gGraphView.h: In member function ‘void gGraphView::setGlobalPointClicked(int)’:
Graphs/gGraphView.h:870: error: ‘m_global_point_clicked’ was not declared in this scope
Graphs/gGraphView.h: In member function ‘int gGraphView::size()’:
Graphs/gGraphView.h:898: error: ‘m_graphs’ was not declared in this scope
Graphs/gGraphView.h: In member function ‘gGraph* gGraphView::operator[](int)’:
Graphs/gGraphView.h:901: error: ‘m_graphs’ was not declared in this scope
Graphs/gGraphView.h: In member function ‘void gGraphView::setEmptyText(int)’:
Graphs/gGraphView.h:924: error: ‘m_emptytext’ was not declared in this scope
In file included from Graphs/gSummaryChart.h:12,
from daily.h:21,
from mainwindow.h:17,
from main.cpp:18:
Graphs/gXAxis.h: At global scope:
Graphs/gXAxis.h:16: error: expected ‘)’ before ‘col’
In file included from Graphs/gSummaryChart.h:12,
from daily.h:21,
from mainwindow.h:17,
from main.cpp:18:
Graphs/gXAxis.h:39: error: ‘QColor’ does not name a type
Graphs/gXAxis.h:40: error: ‘QColor’ does not name a type
Graphs/gXAxis.h:41: error: ‘QColor’ does not name a type
Graphs/gXAxis.h:42: error: ‘QColor’ does not name a type
Graphs/gXAxis.h:44: error: ‘qint64’ does not name a type
In file included from daily.h:21,
from mainwindow.h:17,
from main.cpp:18:
Graphs/gSummaryChart.h:28: error: expected ‘)’ before ‘label’
In file included from daily.h:21,
from mainwindow.h:17,
from main.cpp:18:
Graphs/gSummaryChart.h:41: error: ‘ChannelID’ has not been declared
Graphs/gSummaryChart.h:41: error: ‘QColor’ has not been declared
Graphs/gSummaryChart.h:65: error: ‘Qt’ has not been declared
Graphs/gSummaryChart.h:65: error: ISO C++ forbids declaration of ‘Orientation’ with no type
Graphs/gSummaryChart.h:65: error: expected ‘;’ before ‘m_orientation’
Graphs/gSummaryChart.h:67: error: ISO C++ forbids declaration of ‘QVector’ with no type
Graphs/gSummaryChart.h:67: error: expected ‘;’ before ‘<’ token
Graphs/gSummaryChart.h:68: error: ISO C++ forbids declaration of ‘QVector’ with no type
Graphs/gSummaryChart.h:68: error: expected ‘;’ before ‘<’ token
Graphs/gSummaryChart.h:69: error: ISO C++ forbids declaration of ‘QVector’ with no type
Graphs/gSummaryChart.h:69: error: expected ‘;’ before ‘<’ token
Graphs/gSummaryChart.h:71: error: ISO C++ forbids declaration of ‘QVector’ with no type
Graphs/gSummaryChart.h:71: error: expected ‘;’ before ‘<’ token
Graphs/gSummaryChart.h:72: error: ISO C++ forbids declaration of ‘QVector’ with no type
Graphs/gSummaryChart.h:72: error: expected ‘;’ before ‘<’ token
Graphs/gSummaryChart.h:73: error: ISO C++ forbids declaration of ‘QHash’ with no type
Graphs/gSummaryChart.h:73: error: expected ‘;’ before ‘<’ token
Graphs/gSummaryChart.h:74: error: ISO C++ forbids declaration of ‘QHash’ with no type
Graphs/gSummaryChart.h:74: error: expected ‘;’ before ‘<’ token
Graphs/gSummaryChart.h:75: error: ISO C++ forbids declaration of ‘QHash’ with no type
Graphs/gSummaryChart.h:75: error: expected ‘;’ before ‘<’ token
Graphs/gSummaryChart.h:76: error: ISO C++ forbids declaration of ‘QHash’ with no type
Graphs/gSummaryChart.h:76: error: expected ‘;’ before ‘<’ token
Graphs/gSummaryChart.h:82: error: ‘QString’ does not name a type
Graphs/gSummaryChart.h:85: error: ‘qint64’ does not name a type
Graphs/gSummaryChart.h:89: error: ‘qint64’ does not name a type
Graphs/gSummaryChart.h:98: error: ‘QKeyEvent’ has not been declared
Graphs/gSummaryChart.h:101: error: ‘QMouseEvent’ has not been declared
Graphs/gSummaryChart.h:104: error: ‘QMouseEvent’ has not been declared
Graphs/gSummaryChart.h:107: error: ‘QMouseEvent’ has not been declared
Graphs/gSummaryChart.h: In member function ‘void SummaryChart::addSlice(int, int, SummaryType, EventDataType)’:
Graphs/gSummaryChart.h:43: error: ‘m_codes’ was not declared in this scope
Graphs/gSummaryChart.h:44: error: ‘m_colors’ was not declared in this scope
Graphs/gSummaryChart.h:45: error: ‘m_type’ was not declared in this scope
Graphs/gSummaryChart.h:47: error: ‘m_typeval’ was not declared in this scope
In file included from daily.h:27,
from mainwindow.h:17,
from main.cpp:18:
Graphs/gLineChart.h: At global scope:
Graphs/gLineChart.h:23: error: ISO C++ forbids declaration of ‘QColor’ with no type
Graphs/gLineChart.h:23: error: expected ‘,’ or ‘...’ before ‘col’
Graphs/gLineChart.h:44: error: ISO C++ forbids declaration of ‘QVector’ with no type
Graphs/gLineChart.h:44: error: expected ‘;’ before ‘<’ token
Graphs/gLineChart.h:47: error: ISO C++ forbids declaration of ‘QVector’ with no type
Graphs/gLineChart.h:47: error: expected ‘;’ before ‘<’ token
Graphs/gLineChart.h:51: error: ‘QColor’ does not name a type
Graphs/gLineChart.h: In member function ‘virtual bool AHIChart::isEmpty()’:
Graphs/gLineChart.h:40: error: ‘m_data’ was not declared in this scope
Graphs/gLineChart.h: At global scope:
Graphs/gLineChart.h:67: error: expected ‘)’ before ‘code’
Graphs/gLineChart.h:105: error: ‘ChannelID’ has not been declared
Graphs/gLineChart.h:105: error: ‘QColor’ has not been declared
In file included from daily.h:27,
from mainwindow.h:17,
from main.cpp:18:
Graphs/gLineChart.h:108: error: ‘ChannelID’ has not been declared
Graphs/gLineChart.h:111: error: ‘ChannelID’ has not been declared
Graphs/gLineChart.h:117: error: ‘QColor’ does not name a type
Graphs/gLineChart.h:127: error: ‘QPoint’ does not name a type
Graphs/gLineChart.h:131: error: ISO C++ forbids declaration of ‘QVector’ with no type
Graphs/gLineChart.h:131: error: expected ‘;’ before ‘<’ token
Graphs/gLineChart.h:132: error: ISO C++ forbids declaration of ‘QVector’ with no type
Graphs/gLineChart.h:132: error: expected ‘;’ before ‘<’ token
Graphs/gLineChart.h:133: error: ISO C++ forbids declaration of ‘QVector’ with no type
Graphs/gLineChart.h:133: error: expected ‘;’ before ‘<’ token
Graphs/gLineChart.h:134: error: ISO C++ forbids declaration of ‘QHash’ with no type
Graphs/gLineChart.h:134: error: expected ‘;’ before ‘<’ token
In file included from daily.h:27,
from mainwindow.h:17,
from main.cpp:18:
Graphs/gLineChart.h: In member function ‘void gLineChart::addPlot(int, int, bool)’:
Graphs/gLineChart.h:105: error: ‘m_codes’ was not declared in this scope
Graphs/gLineChart.h:105: error: ‘m_colors’ was not declared in this scope
Graphs/gLineChart.h:105: error: ‘m_enabled’ was not declared in this scope
In file included from daily.h:27,
from mainwindow.h:17,
from main.cpp:18:
Graphs/gLineChart.h:105: error: ‘m_square’ was not declared in this scope
Graphs/gLineChart.h: In member function ‘bool gLineChart::plotEnabled(int)’:
Graphs/gLineChart.h:108: error: ‘m_enabled’ was not declared in this scope
Graphs/gLineChart.h: In member function ‘void gLineChart::setPlotEnabled(int, bool)’:
Graphs/gLineChart.h:111: error: ‘m_enabled’ was not declared in this scope
In file included from mainwindow.h:17,
from main.cpp:18:
daily.h: At global scope:
daily.h:40: error: expected class-name before ‘{’ token
daily.h:41: error: ISO C++ forbids declaration of ‘Q_OBJECT’ with no type
daily.h:43: error: expected ‘;’ before ‘public’
daily.h:78: error: ‘QDate’ has not been declared
daily.h:84: error: ‘QDate’ does not name a type
daily.h:96: error: expected ‘;’ before ‘(’ token
daily.h:98: error: ‘QString’ does not name a type
daily.h:104: error: expected ‘:’ before ‘slots’
daily.h:111: error: expected primary-expression before ‘void’
daily.h:111: error: ISO C++ forbids declaration of ‘slots’ with no type
daily.h:111: error: expected ‘;’ before ‘void’
daily.h:152: error: ISO C++ forbids declaration of ‘QUrl’ with no type
daily.h:152: error: expected ‘,’ or ‘...’ before ‘&’ token
daily.h:161: error: ‘QTreeWidgetItem’ has not been declared
daily.h:183: error: ‘QTableWidgetItem’ has not been declared
daily.h:188: error: ‘QTableWidgetItem’ has not been declared
daily.h:234: error: expected ‘;’ before ‘(’ token
daily.h:245: error: ‘QDate’ has not been declared
daily.h:250: error: ‘QDate’ has not been declared
daily.h:255: error: ‘QDate’ has not been declared
daily.h:261: error: ‘QTreeWidget’ has not been declared
daily.h:270: error: ISO C++ forbids declaration of ‘QList’ with no type
daily.h:270: error: expected ‘;’ before ‘<’ token
daily.h:271: error: ISO C++ forbids declaration of ‘QList’ with no type
daily.h:271: error: expected ‘;’ before ‘<’ token
daily.h:272: error: ISO C++ forbids declaration of ‘QList’ with no type
daily.h:272: error: expected ‘;’ before ‘<’ token
daily.h:273: error: ISO C++ forbids declaration of ‘QHash’ with no type
daily.h:273: error: expected ‘;’ before ‘<’ token
daily.h:274: error: ISO C++ forbids declaration of ‘QVector’ with no type
daily.h:274: error: expected ‘;’ before ‘<’ token
daily.h:275: error: ISO C++ forbids declaration of ‘QGLContext’ with no type
daily.h:275: error: expected ‘;’ before ‘*’ token
daily.h:277: error: ISO C++ forbids declaration of ‘QList’ with no type
daily.h:277: error: expected ‘;’ before ‘<’ token
daily.h:287: error: ‘QDate’ does not name a type
daily.h:288: error: ISO C++ forbids declaration of ‘QMenu’ with no type
daily.h:288: error: expected ‘;’ before ‘*’ token
daily.h:292: error: ISO C++ forbids declaration of ‘QHBoxLayout’ with no type
daily.h:292: error: expected ‘;’ before ‘*’ token
daily.h:293: error: ISO C++ forbids declaration of ‘QLabel’ with no type
daily.h:293: error: expected ‘;’ before ‘*’ token
daily.h:294: error: ISO C++ forbids declaration of ‘QIcon’ with no type
daily.h:294: error: expected ‘;’ before ‘*’ token
daily.h:295: error: ISO C++ forbids declaration of ‘QIcon’ with no type
daily.h:295: error: expected ‘;’ before ‘*’ token
daily.h: In member function ‘Layer* Daily::AddCPAP(Layer*)’:
daily.h:278: error: ‘CPAPData’ was not declared in this scope
daily.h: In member function ‘Layer* Daily::AddSTAGE(Layer*)’:
daily.h:279: error: ‘STAGEData’ was not declared in this scope
daily.h: In member function ‘Layer* Daily::AddOXI(Layer*)’:
daily.h:280: error: ‘OXIData’ was not declared in this scope
In file included from mainwindow.h:18,
from main.cpp:18:
overview.h: At global scope:
overview.h:31: error: expected class-name before ‘{’ token
overview.h:32: error: ISO C++ forbids declaration of ‘Q_OBJECT’ with no type
overview.h:34: error: expected ‘;’ before ‘public’
overview.h:54: error: ‘QDate’ has not been declared
overview.h:54: error: ‘QDate’ has not been declared
overview.h:59: error: expected ‘;’ before ‘(’ token
In file included from mainwindow.h:18,
from main.cpp:18:
overview.h:65: error: ISO C++ forbids declaration of ‘QVector’ with no type
overview.h:65: error: expected ‘;’ before ‘<’ token
overview.h:68: error: ‘QString’ has not been declared
overview.h:70: error: expected ‘:’ before ‘slots’
overview.h:74: error: expected primary-expression before ‘private’
overview.h:74: error: ISO C++ forbids declaration of ‘slots’ with no type
overview.h:74: error: expected ‘;’ before ‘private’
overview.h:87: error: ISO C++ forbids declaration of ‘QDate’ with no type
overview.h:87: error: expected ‘,’ or ‘...’ before ‘&’ token
overview.h:110: error: ISO C++ forbids declaration of ‘QHBoxLayout’ with no type
overview.h:110: error: expected ‘;’ before ‘*’ token
overview.h:112: error: ISO C++ forbids declaration of ‘QIcon’ with no type
overview.h:112: error: expected ‘;’ before ‘*’ token
overview.h:113: error: ISO C++ forbids declaration of ‘QIcon’ with no type
overview.h:113: error: expected ‘;’ before ‘*’ token
overview.h:116: error: ‘QDateEdit’ has not been declared
overview.h:116: error: ‘QDate’ has not been declared
In file included from oximetry.h:14,
from mainwindow.h:19,
from main.cpp:18:
./qextserialport/qextserialport.h:182: error: expected initializer before ‘:’ token
make: *** [main.o] Error 1
Since it worked for you, I'm going to assume my OS is probably missing something that is needed.

EDIT: To help others, I updated the tutorial with your additional information:
Tutorial for installing SourceForge SleepyHead CPAP/BiPAP (Sleep Apnea) software (http://ubuntuforums.org/showthread.php?p=11755984#post11755984)

rocksockdoc
March 11th, 2012, 07:17 AM
FYI ... a friend of mine who is a lifelong developer was able to compile SleepyHead on Ubuntu Lucid 10.04 (development workstation) using only these three commands:

git clone git://sleepyhead.git.sourceforge.net/gitroot/sleepyhead/sleepyhead
qmake
make
./SleepyHead So I wholly re-edited this tutorial to help others who are also on Lucid 10.04:
Tutorial for installing SourceForge SleepyHead CPAP/BiPAP (Sleep Apnea) software (http://ubuntuforums.org/showthread.php?t=1937358)

If you are on Ubuntu Lucid 10.04, it would be nice if you can confirm the steps to obtain, compile, & run are as shown below:

$ sudo apt-get install git-core qt4-dev-tools libqt4-opengl-dev libqtwebkit-dev zlib1g-dev
$ git clone git://sleepyhead.git.sourceforge.net/gitroot/sleepyhead/sleepyhead
$ qmake
$ make
$ ./SleepyHead